program: Gaussian 09
title: 000229843
version: EM64L-G09RevD.01
frameworkgroup: C1[X(C9H9NO3)]
method: RPBEPBE
basis: SDD
operation: Freq
keyword: #pfreq=noraman
keyword: PBEPBE/SDD
title: #p freq=noraman PBEPBE/SDD
converged: NO YES NO NO
title: Mulliken charges:
elementType: O O O N C C C C C C C C C H H H H H H H H H
charge: -0.250307 -0.228456 -0.240166 0.097702 0.492679 0.327828 -0.360872 -0.369877 -0.356737 -0.342076 -0.268401 -0.201897 -0.537195 0.243094 0.228810 0.260828 0.248141 0.276692 0.269660 0.228417 0.228413 0.253722
chargesum: 0.00000
title: Mulliken charges with hydrogens summed into heavy atoms:
elementType: O O O N C C C C C C C C C
charge: -0.250307 -0.228456 -0.240166 0.097702 0.492679 0.327828 -0.117777 -0.141067 -0.095909 -0.093935 0.008291 0.067762 0.173356
polarizability: 2.77372517e+02 7.24163251e+00 1.17828004e+02 -2.31051971e-02 1.85239241e-02 4.97410668e+01
1716.lowfreq: -8.9557 -7.3062 -0.0006 -0.0004 0.0006 1.0482 45.9311 54.8524 83.4733
frequency: 45.8508 54.8373 83.4712 114.2977 150.5555 199.6953 200.4730 241.0133 255.4710 313.6240 376.0349 416.0631 458.7905 510.3475 515.2750 545.0667 632.0132 661.1513 666.8655 740.4882 753.2935 811.9258 833.0985 848.6137 852.1494 940.1412 948.7719 966.9108 980.3695 998.7839 1003.1740 1112.4719 1114.2500 1157.2836 1173.1632 1203.3102 1219.9728 1247.1763 1262.7809 1296.6376 1314.9202 1374.5788 1380.3845 1436.4051 1440.7019 1469.9059 1470.5864 1504.2998 1565.1970 1617.2953 1633.3631 2972.2890 3065.5808 3116.8291 3136.2894 3136.7614 3142.2774 3168.5245 3176.1011 3201.9835
redmass: 5.8536 5.7992 6.3722 3.9362 3.5870 1.7303 4.8398 1.6198 5.9180 5.5070 3.7173 2.9099 4.6556 6.1500 2.3679 5.1084 6.8499 5.2921 9.5104 3.8051 5.4989 1.3107 1.6686 5.2817 1.6548 5.6438 1.3751 1.3405 8.6536 2.6175 1.2830 1.2582 1.3900 1.3426 1.4593 1.6832 2.5966 2.1416 2.5749 2.2216 1.3383 4.3314 4.0064 2.1983 1.5754 1.0791 1.0500 2.5486 6.7101 5.9097 5.8728 1.0326 1.1046 1.0891 1.0999 1.0902 1.0885 1.0953 1.0958 1.0947
irintensity: 0.5116 0.1378 2.1931 9.4176 0.1454 1.3093 3.3592 0.5258 3.6073 0.9928 2.0909 0.4548 0.4486 17.1966 22.0268 32.4567 0.9408 0.1703 3.1787 0.0002 3.4461 7.3503 100.6864 0.4981 0.1413 27.3882 2.4464 5.2378 63.1625 3.0767 42.0651 0.1591 18.5390 0.0534 504.3852 74.8009 474.6355 142.5728 12.6197 1.3699 2.3894 158.3932 52.9784 2.4378 12.0321 67.5480 17.2111 110.3376 2.0426 506.6515 32.0705 70.2559 40.1131 0.1230 22.8507 6.1495 3.2225 11.2756 4.8018 10.0374
temp: 298.150 k
press: 1.00000 atm
elementType: 8 8 8 7 6 6 6 6 6 6 6 6 6 1 1 1 1 1 1 1 1 1
symmnumber: 1
zpe: 432031.0 jmol-1
zpe.correction: 0.164552 hartree
zpe.thermalcorrener: 0.176510 hartree
zpe.thermalcorrenthalpy: 0.177454 hartree
zpe.thermalcorrgfe: 0.125381 hartree
zpe.sumelectzpe: -627.723655 hartree
zpe.sumelectthermal: -627.711697 hartree
zpe.sumelectthermalent: -627.710753 hartree
zpe.sumelectthermalfe: -627.762827 hartree
dipole: 8.5302 -1.6190 0.0004
dipole: 8.6825
quadrupole: -96.7895 -68.7374 -78.0216
quadrupole: -9.0750 0.0309 0.0193
quadrupole: -15.6066 12.4454 3.1612 -9.0750 0.0309 0.0193
hfenergy: -627.8882073 hartree
pointgroup: C01 [X(C9H9N1O3)]
dipole: 3.3404801 -0.712703 -0.0460133 debye
dipolederiv: -2.2336648 0.3884437 0.0242791 0.3262006 -0.3927188 -0.0062261 0.0198416 -0.0057089 -0.2927626 -1.0508156 -0.2647021 -0.0156743 -0.4062361 -0.6538102 -0.0242141 -0.0239833 -0.0242381 -0.2562539 -0.7935396 0.1346903 0.0087216 0.5748382 -0.7417529 -0.0309246 0.0362409 -0.0308148 -0.246261 2.5343045 0.1079477 0.0046544 -0.4378046 1.0746684 0.0544587 -0.0301216 0.0541756 0.1951701 -1.0681244 0.0527464 0.0037991 0.2084093 -0.1414598 -0.0089532 0.0131647 -0.0089578 -0.0056554 2.0109906 -0.2515566 -0.0154017 0.0930132 0.1259693 0.0006854 0.0069139 0.0003503 0.1204052 0.5734474 -0.0176041 -0.0013322 0.2936009 0.1250142 0.01728 0.0183895 0.0174798 -0.1437187 0.5039583 -0.0647184 -0.0041011 -0.3525118 0.1047558 0.0141489 -0.0218183 0.0138094 -0.1057513 -0.6026007 0.1200874 0.0077029 0.5953352 -0.0318093 0.0084737 0.0375863 0.0087049 -0.1643012 -0.7557352 0.0145871 0.0007885 -0.5344791 -0.0078748 0.0119723 -0.0347012 0.0121769 -0.1892219 1.6003368 0.0242144 0.0004165 0.4353454 0.0668042 0.0065792 0.0261477 0.0069946 -0.0439908 -1.6735718 -0.0255311 -0.000463 -0.4966698 0.0467451 0.0130219 -0.030292 0.0127123 -0.1578964 0.7033636 -0.1787233 -0.0113932 -0.7040767 0.4638733 0.0092322 -0.0437541 0.0091365 0.3173592 0.0517195 0.096136 0.006171 0.0477194 -0.0345615 -0.0121027 0.00324 -0.0121241 0.1518578 0.0333189 -0.0936691 -0.0061882 -0.0595563 -0.0206542 -0.0106217 -0.004006 -0.0105599 0.1410954 0.029975 -0.0748479 -0.0048218 -0.0749441 0.0130406 -0.0103596 -0.0049759 -0.0104102 0.1727313 0.0265686 0.0743695 0.0049481 0.0953137 -0.0329445 -0.0130247 0.0061507 -0.0131531 0.1658013 0.0969403 0.0140472 0.000883 0.0344662 0.0171243 -0.0092449 0.0029096 -0.0092797 0.1630786 0.0344208 0.021877 0.0015322 0.0834527 0.0205984 -0.0113518 0.0056098 -0.0112942 0.2029864 0.0675733 -0.0319874 -0.082462 0.1619868 -0.030692 -0.0836083 0.0084061 -0.0997322 -0.0887274 0.0673352 -0.0431804 0.0789092 0.1607017 -0.0544288 0.0878875 0.0128274 0.103678 -0.0639355 -0.1562007 -0.0026263 -0.0009682 -0.0441048 0.0841133 -0.0031082 -0.0037757 -0.0029452 0.1279907 unknown
polarizability: 277.6214947|3.5561609|117.3083|0.1170438|4.2765957|50.0117928 unknown
InChI: InChI=1S/C9H9NO3/c1-13-9-4-2-8(3-5-9)6-7-10(11)12/h2-7H,1H3
charge 0 multiplicity 1
22 atoms
O  4.101566 0.142025 -0.001081
O  -4.760931 -1.183597 -0.079032
O  -4.319198 1.061627 0.058704
N  -3.941048 -0.176932 -0.018136
C  -0.133662 0.322012 0.009543
C  2.708761 0.126289 -0.002935
C  0.688744 1.489062 0.084566
C  0.514552 -0.945028 -0.072556
C  2.086068 1.399912 0.078875
C  1.91524 -1.051894 -0.079407
C  -1.582306 0.487556 0.020975
C  -2.523557 -0.501466 -0.039834
C  4.810395 -1.142297 -0.080035
H  0.212483 2.474322 0.148352
H  -0.081762 -1.86191 -0.132393
H  2.718376 2.290249 0.136439
H  2.380255 -2.039718 -0.144034
H  -1.972648 1.512969 0.085532
H  -2.349897 -1.575916 -0.106347
H  4.573495 -1.671175 -1.022409
H  4.566341 -1.785891 0.78604
H  5.877136 -0.8784 -0.059228
