program: Gaussian 09
title: 000229827
version: EM64L-G09RevD.01
frameworkgroup: C1[X(C15H23NO3S2)]
method: RPBEPBE
basis: SDD
operation: Freq
keyword: #p
keyword: freq=noraman
keyword: PBEPBE/SDD
title: #p freq=noraman PBEPBE/SDD
converged: YES YES NO NO
title: Mulliken charges:
elementType: S S O O O N C C C C C C C C C C C C C C C H H H H H H H H H H H H H H H H H H H H H H H
charge: 0.477062 0.127627 -0.263270 -0.550514 -0.193608 0.088198 -0.332100 -0.308991 -0.369399 -0.379837 -0.687842 -0.685146 -0.234570 -0.179589 -0.236734 0.427253 -0.365643 -0.301797 -0.270644 -0.597237 -0.623064 0.228447 0.262896 0.251898 0.212130 0.253736 0.208603 0.230082 0.228597 0.224914 0.219672 0.209848 0.228101 0.212297 0.206484 0.274238 0.248257 0.275726 0.251436 0.251478 0.288370 0.251184 0.223998 0.217454
chargesum: 0.00000
title: Mulliken charges with hydrogens summed into heavy atoms:
elementType: S S O O O N C C C C C C C C C C C C C C C
charge: 0.477062 0.127627 -0.263270 -0.550514 -0.193608 0.088198 0.159243 0.155037 0.092940 0.078843 -0.033408 -0.038263 -0.234570 0.094649 0.011522 0.427253 -0.089918 -0.050360 -0.270644 -0.057389 0.069571
polarizability: 4.11748047e+02 -3.24526399e+00 2.12681082e+02 -9.91708995e-01 -9.01281812e+00 1.56180558e+02
1716.lowfreq: -7.6322 -6.5077 -3.5745 -0.0005 0.0012 0.0021 12.7845 17.6946 21.3283
frequency: 11.6754 17.6704 21.2447 36.1504 44.6857 50.8612 59.4012 65.1247 72.3351 92.7302 104.3396 109.4231 130.7687 160.2007 167.1994 186.9852 205.3285 218.9114 226.5716 239.9535 246.7397 256.6194 270.4193 290.7559 297.5927 313.9284 317.1088 347.2615 351.0117 402.7472 414.8499 451.1617 456.6563 477.3216 491.8955 544.6372 590.2183 614.2672 622.8474 628.9477 699.6899 733.0513 751.4131 752.8471 756.1145 758.8838 798.9244 835.0172 866.1965 871.4282 877.2094 886.1039 911.6928 926.8676 965.9373 983.8945 1000.6406 1005.0056 1031.1808 1052.7598 1055.5314 1060.0634 1067.5982 1074.1180 1109.0699 1116.7248 1128.4544 1139.6204 1159.0906 1184.9622 1210.4636 1217.3549 1235.7798 1253.4998 1254.4594 1280.7655 1284.8745 1292.5468 1295.9573 1307.2681 1321.1212 1361.1039 1365.4265 1384.8462 1390.6966 1396.1947 1398.6465 1409.0585 1429.2117 1446.8179 1453.5355 1465.8614 1469.6054 1475.0901 1478.7628 1479.7065 1481.2028 1483.0066 1486.9486 1490.4978 1557.2192 1591.1698 1598.7693 2952.4093 2965.9477 2977.0637 2977.8882 2983.4530 2994.9956 3019.0820 3033.2547 3053.1334 3055.8946 3074.3915 3076.8046 3076.9593 3082.1244 3083.1969 3092.5987 3094.9341 3095.5446 3118.4939 3134.5713 3142.2462 3155.0689 3162.7440
redmass: 4.3156 4.3623 4.5603 3.6941 4.5872 3.9377 3.5396 2.3044 2.6035 2.5645 5.4422 3.7731 2.0860 8.6053 3.2635 1.9820 3.5215 2.9129 2.5131 1.2100 1.4708 1.8989 6.0337 3.9115 3.6167 4.8292 4.7910 3.9707 5.3673 2.9244 8.5440 4.6689 7.7200 4.2078 4.8222 7.9150 4.3185 5.4174 6.9778 5.0374 7.8081 3.8233 1.2542 1.3060 1.1847 3.2730 3.8041 1.4143 1.2358 1.4326 5.7375 1.2190 1.6260 1.9168 1.3854 1.7624 1.9054 1.9761 3.0439 2.8042 3.2597 1.3149 2.3321 2.5263 1.5554 1.3370 2.1901 2.3019 2.1795 1.2434 2.9465 1.8003 1.4121 1.3964 1.1956 1.1307 1.2130 1.0974 1.2730 1.3205 1.6525 1.4580 4.4177 1.6460 1.2058 1.2077 1.2686 4.4655 1.0994 1.1029 1.0824 1.0448 2.2183 1.0540 1.0461 1.0424 1.0413 1.0487 1.0715 1.0919 7.9331 7.3565 7.4107 1.0675 1.0676 1.0363 1.0362 1.0372 1.0630 1.0604 1.0589 1.0973 1.0989 1.0948 1.0983 1.0960 1.0986 1.0990 1.1021 1.1011 1.0985 1.1058 1.0878 1.0875 1.0964 1.0965
irintensity: 0.5911 0.2776 0.3106 0.3517 0.9681 0.4904 0.1960 0.1221 0.1906 0.4803 1.8237 1.6629 0.0012 8.9978 4.1115 3.3960 5.0667 1.5693 4.1406 0.1541 1.3235 0.9865 1.5127 23.1821 0.3974 7.0193 8.9592 8.5313 2.6295 0.8542 5.1431 5.7432 1.4795 9.5919 3.6174 23.6983 7.4430 6.8449 1.6989 19.9982 35.6266 2.7939 3.8947 3.7734 3.0755 34.7996 2.2231 28.0565 0.5779 50.3278 305.1605 1.3855 18.4565 6.7716 0.4699 26.3855 7.0922 4.1400 0.0542 5.1350 39.1668 0.0712 8.8153 1.4857 4.1928 9.6749 9.5027 9.0341 53.6092 107.6575 269.5630 31.0680 40.5689 8.3185 3.7999 0.5769 6.1590 6.8488 0.0199 1.8819 35.4698 12.8302 13.1510 12.9392 17.1363 10.9373 9.7226 11.1913 28.4365 5.6181 2.9418 14.5752 15.5809 6.3526 7.4370 3.2525 9.5517 14.2187 12.9458 16.3977 72.2117 200.1081 91.2855 28.9694 36.2111 51.9824 26.0782 39.5966 27.9183 11.8065 21.6884 1.1515 10.9117 3.1831 45.3935 33.2202 35.9944 34.4380 7.2635 52.2282 23.0762 17.9589 4.6175 0.6467 6.6389 1.1724
temp: 298.150 k
press: 1.00000 atm
elementType: 16 16 8 8 8 7 6 6 6 6 6 6 6 6 6 6 6 6 6 6 6 1 1 1 1 1 1 1 1 1 1 1 1 1 1 1 1 1 1 1 1 1 1 1
symmnumber: 1
zpe: 930807.8 jmol-1
zpe.correction: 0.354526 hartree
zpe.thermalcorrener: 0.379832 hartree
zpe.thermalcorrenthalpy: 0.380777 hartree
zpe.thermalcorrgfe: 0.294807 hartree
zpe.sumelectzpe: -1660.219299 hartree
zpe.sumelectthermal: -1660.193992 hartree
zpe.sumelectthermalent: -1660.193048 hartree
zpe.sumelectthermalfe: -1660.279018 hartree
dipole: -2.3607 1.7615 1.2814
dipole: 3.2122
quadrupole: -118.4972 -135.2427 -146.8559
quadrupole: -10.4319 1.8311 1.3911
quadrupole: 15.0347 -1.7108 -13.3239 -10.4319 1.8311 1.3911
hfenergy: -1660.5738247 hartree
pointgroup: C01 [X(C15H23N1O3S2)]
dipole: -1.0495325 -0.3699923 0.5988904 debye
polarizability: 366.5422276|76.0581528|225.8810183|35.3118717|47.4048428|188.1864403 unknown
InChI: InChI=1S/C9H9O2S2.C6H14NO/c1-2-12-9(10)7-3-5-8(13-11)6-4-7;1-3-5-7(8)6-4-2/h3-6H,2H2,1H3;3-6H2,1-2H3
charge 0 multiplicity 1
44 atoms
S  -0.618187 -1.86514 -2.367617
S  5.401174 0.824164 0.563358
O  -1.643046 -3.282635 -0.322681
O  -2.083384 -1.141761 -1.868758
O  3.35909 2.558545 1.141435
N  -2.613036 -2.401669 -0.297835
C  -2.569781 -1.404575 0.832039
C  -3.963832 -2.79513 -0.833624
C  -3.470001 -0.171032 0.649868
C  -3.884568 -3.88469 -1.90962
C  -3.195572 0.866378 1.761138
C  -5.29751 -4.300287 -2.373928
C  0.655686 -0.878616 -1.463644
C  0.320732 0.368719 -0.887529
C  1.977955 -1.377878 -1.387991
C  2.648357 0.627457 -0.139194
C  1.312188 1.112552 -0.225311
C  2.968529 -0.625245 -0.728501
C  3.64634 1.473704 0.573375
C  6.198793 2.17721 1.625156
C  6.095413 1.879338 3.126902
H  -2.84558 -1.963225 1.752099
H  -1.510519 -1.11416 0.917417
H  -4.431016 -1.88008 -1.231597
H  -4.560563 -3.147793 0.036361
H  -3.269061 0.266758 -0.343995
H  -4.537932 -0.460884 0.677151
H  -3.300882 -3.49615 -2.76304
H  -3.334095 -4.755818 -1.51314
H  -3.845173 1.751037 1.638686
H  -2.145242 1.211838 1.733271
H  -3.385426 0.445295 2.766403
H  -5.234746 -5.078936 -3.154532
H  -5.853512 -3.443783 -2.799053
H  -5.894316 -4.711988 -1.537906
H  -0.708227 0.734495 -0.97284
H  2.229756 -2.350932 -1.823892
H  1.080731 2.083623 0.2246
H  3.98786 -1.020902 -0.664309
H  7.24229 2.226696 1.273039
H  5.672699 3.110964 1.365751
H  5.039592 1.842472 3.444179
H  6.573892 0.918603 3.385059
H  6.597035 2.68056 3.703251
