program: Gaussian 09
title: 000229813
version: EM64L-G09RevD.01
frameworkgroup: C1[X(C11H12N2O4)]
method: RPBEPBE
basis: SDD
operation: Freq
keyword: #p
keyword: freq=noraman
keyword: PBEPBE/SDD
title: #p freq=noraman PBEPBE/SDD
converged: YES YES NO NO
title: Mulliken charges:
elementType: O O O O N N C C C C C C C C C C C H H H H H H H H H H H H
charge: -0.395933 -0.344133 -0.237661 -0.277841 -0.416479 -0.628775 -0.144966 -0.464863 0.224486 0.141707 0.262857 0.184746 -0.337489 -0.329339 -0.220715 -0.239581 -0.222420 0.282410 0.269907 0.247031 0.340877 0.277968 0.210677 0.236067 0.234430 0.236524 0.324915 0.391778 0.393815
chargesum: 0.00000
title: Mulliken charges with hydrogens summed into heavy atoms:
elementType: O O O O N N C C C C C C C C C C C
charge: -0.002118 -0.344133 -0.237661 -0.277841 -0.075603 0.087918 0.137444 0.052074 0.224486 0.141707 0.262857 0.184746 -0.059521 -0.118662 0.015352 -0.005151 0.014105
polarizability: 2.00169475e+02 1.64912473e+00 1.33753903e+02 6.35929149e-02 2.21952075e+01 1.08670997e+02
1716.lowfreq: -9.8530 -6.7156 -3.8689 -0.0009 -0.0007 -0.0006 16.4695 26.4166 46.2484
frequency: 16.0249 26.3309 46.2334 67.9871 82.5251 88.6979 117.1237 163.6845 167.2359 225.6932 243.5979 268.0554 321.2389 349.2311 398.3248 423.3760 440.8353 468.9473 493.4989 533.9974 550.7672 596.8102 611.7397 614.9714 635.8283 663.4643 684.6819 691.4394 694.1009 702.1085 793.9153 814.1737 835.5273 848.6431 851.8859 887.6390 937.3696 949.2512 987.7767 989.8557 1010.3242 1022.8162 1029.5364 1047.9938 1086.6515 1094.7060 1114.4942 1152.0996 1175.3348 1196.8622 1222.4500 1231.2204 1284.7084 1308.5528 1319.9044 1323.0869 1351.6134 1366.5773 1387.4629 1430.1906 1435.1188 1474.1722 1512.7160 1551.6382 1599.0025 1611.9768 1612.9790 1646.8802 1664.8991 3016.3719 3035.9706 3078.9748 3123.5572 3135.7424 3149.4547 3162.5806 3173.2105 3237.3904 3506.5711 3518.8641 3589.1816
redmass: 4.0876 6.9203 5.5335 7.6346 6.2698 5.9503 4.9757 4.5941 5.5191 5.5904 5.8198 6.7999 5.4475 4.8555 2.7962 5.8908 4.4787 2.3373 3.0115 3.3879 2.9102 1.3800 3.6709 5.7785 1.4534 4.8938 3.9317 1.5956 3.6973 1.5416 2.2916 3.2740 1.6819 2.6120 1.2589 2.6113 1.4371 3.9303 1.4291 5.3742 1.3422 2.8268 3.0996 2.7917 1.6575 2.4080 1.7883 2.7598 1.0606 1.1468 1.1985 1.3002 1.8535 1.5027 1.3496 1.3427 2.3218 3.3657 9.0346 1.2464 1.8814 2.0614 2.3874 5.6467 5.7412 5.4373 4.6696 7.9538 1.3521 1.0611 1.0826 1.1007 1.0874 1.0872 1.0922 1.0959 1.1005 1.0707 1.0764 1.0644 1.0859
irintensity: 0.4663 1.6410 0.4305 2.4205 5.5304 0.2021 4.3765 3.7996 5.4711 8.4310 12.8164 1.5725 13.2714 15.0027 0.1310 4.2452 7.1449 6.0680 8.1798 69.7415 31.8164 98.7985 18.0686 1.5380 86.9481 3.0111 23.8233 75.0311 23.7257 154.8274 33.8576 34.7326 141.5815 24.9774 0.6966 23.2337 1.9121 11.0217 1.1693 1.9370 0.9892 24.7702 50.9957 174.5185 42.7508 42.8893 2.6972 2.6019 1.1818 8.3139 1.2944 16.3099 49.9791 61.7766 6.0051 3.8358 191.1906 68.9180 3.6639 22.8491 7.8508 92.2866 281.8732 243.8990 76.1096 65.7006 108.1199 200.9161 167.9725 5.5362 7.6448 5.1590 9.7235 1.8331 19.5476 13.5058 21.2148 671.2171 56.3671 38.5921 69.9831
temp: 298.150 k
press: 1.00000 atm
elementType: 8 8 8 8 7 7 6 6 6 6 6 6 6 6 6 6 6 1 1 1 1 1 1 1 1 1 1 1 1
symmnumber: 1
zpe: 581854.2 jmol-1
zpe.correction: 0.221617 hartree
zpe.thermalcorrener: 0.237497 hartree
zpe.thermalcorrenthalpy: 0.238442 hartree
zpe.thermalcorrgfe: 0.175497 hartree
zpe.sumelectzpe: -835.572986 hartree
zpe.sumelectthermal: -835.557105 hartree
zpe.sumelectthermalent: -835.556161 hartree
zpe.sumelectthermalfe: -835.619105 hartree
dipole: 3.7739 3.5794 -0.9390
dipole: 5.2855
quadrupole: -93.8777 -100.4729 -101.3243
quadrupole: -17.3218 11.1895 6.3037
quadrupole: 4.6806 -1.9146 -2.7660 -17.3218 11.1895 6.3037
hfenergy: -835.7946022 hartree
pointgroup: C01 [X(C11H12N2O4)]
dipole: 1.4608743 -1.2464025 -0.7978556 debye
polarizability: 200.0035497|-0.2647063|98.8467032|-3.3713049|12.2612776|143.7441217 unknown
InChI: InChI=1S/C11H12N2O4/c12-9(14)6-8(11(16)17)13-10(15)7-4-2-1-3-5-7/h1-5,8,13,16H,6,12H2
charge 0 multiplicity 1
29 atoms
O  -3.542535 -2.183895 -0.70561
O  0.127089 -0.016896 1.83054
O  -1.766249 -1.83107 -2.163718
O  -3.877978 2.621404 0.920026
N  -0.513201 -0.199236 -0.387126
N  -2.19114 1.528006 2.088524
C  -1.918195 -0.50964 -0.0790
C  -2.896626 0.705516 -0.179795
C  0.447713 -0.039914 0.588923
C  -2.361147 -1.566699 -1.09323
C  1.876435 0.100595 0.148919
C  -3.006954 1.699761 0.998021
C  2.871726 0.046552 1.158723
C  2.268268 0.289194 -1.203518
C  4.235816 0.163438 0.82346
C  3.634074 0.410018 -1.536805
C  4.621294 0.34333 -0.525875
H  -1.970792 -0.942793 0.936958
H  -3.924596 0.323719 -0.31778
H  -2.655156 1.296662 -1.082107
H  -0.241888 -0.347847 -1.36395
H  2.546988 -0.086814 2.195432
H  1.527019 0.36887 -2.007707
H  4.99669 0.116103 1.609747
H  3.927535 0.560816 -2.58104
H  5.680885 0.436609 -0.787945
H  -2.305748 2.197854 2.850647
H  -1.396904 0.862578 2.122753
H  -3.833024 -2.836918 -1.398667
