program: Gaussian 09
title: 000229812
version: EM64L-G09RevD.01
frameworkgroup: C1[X(C10H14ClN3O2)]
method: RPBEPBE
basis: SDD
operation: Freq
keyword: #p
keyword: freq=noraman
keyword: PBEPBE/SDD
title: #p freq=noraman PBEPBE/SDD
converged: NO YES NO NO
title: Mulliken charges:
elementType: Cl O O N N N C C C C C C C C C C H H H H H H H H H H H H H H
charge: -0.071733 -0.309448 -0.250852 -0.445478 0.086561 -0.687811 0.239626 0.181290 0.430430 -0.436482 0.034161 -0.523546 -0.802256 0.192822 -0.502543 -0.790006 0.243168 0.247253 0.315342 0.269450 0.227526 0.225519 0.371840 0.315615 0.253610 0.214545 0.222246 0.232097 0.262874 0.254179
chargesum: 0.00000
title: Mulliken charges with hydrogens summed into heavy atoms:
elementType: Cl O O N N N C C C C C C C C C C
charge: -0.071733 -0.309448 -0.250852 -0.130136 0.086561 -0.000357 0.239626 0.181290 0.430430 0.053939 0.034161 -0.523546 -0.079760 0.192822 0.187858 -0.040856
polarizability: 2.00680409e+02 7.32292936e+00 1.68366717e+02 2.81064628e+00 -9.31705791e-01 8.86451557e+01
1716.lowfreq: -23.2041 -5.4700 0.0008 0.0015 0.0020 5.6885 9.0080 43.7201 67.9522
frequency: -22.8543 43.6789 67.9203 71.8984 90.0587 103.1562 118.9233 155.9398 167.6502 170.6149 189.7628 216.8124 248.1612 288.6419 302.6105 313.6463 333.9232 344.0096 355.6828 381.9385 414.0204 424.6419 494.5761 522.7204 543.0525 578.9442 592.5013 615.4047 645.3039 668.8706 703.3518 752.7346 773.8681 806.9680 831.6893 887.9783 943.7617 951.1047 984.6089 995.1715 1023.8325 1035.2005 1039.7795 1099.0176 1123.8514 1156.0415 1165.4230 1238.5050 1250.8873 1260.2904 1274.6064 1345.0782 1366.7309 1380.8048 1394.4407 1412.8128 1431.4126 1437.7859 1446.8399 1449.7219 1453.8365 1467.4285 1469.9512 1470.7581 1472.6701 1487.8136 1559.7434 1568.5034 1614.8937 1638.5785 2957.9363 2972.8374 2991.5729 3002.7233 3026.8534 3074.2790 3079.6571 3101.9856 3116.7880 3117.9484 3128.4761 3374.3920 3478.7080 3649.4779
redmass: 1.0324 5.1599 3.3693 4.5838 4.0112 3.2040 3.7534 2.4844 1.5303 1.3793 2.8370 6.6926 3.5937 4.6758 3.7683 3.7550 3.9665 4.1708 3.5730 4.1346 3.3437 1.3217 4.4267 5.6336 3.7253 3.4552 2.7950 6.2301 2.9168 2.3648 5.3924 5.5832 1.0937 5.4835 4.9213 4.1259 3.8373 2.4680 1.6660 1.7239 4.9779 1.6692 1.5069 2.8986 1.3227 1.7256 1.6090 3.5961 5.2662 1.3927 2.6695 1.2410 2.6126 1.2337 1.8636 3.9659 1.4383 1.1964 1.1336 1.3513 1.3274 1.0590 1.1747 1.2553 1.0765 1.6642 6.6505 3.8471 1.2723 5.1699 1.0401 1.0331 1.0378 1.0640 1.0973 1.0985 1.0983 1.0981 1.0951 1.1051 1.0989 1.0592 1.0758 1.0911
irintensity: 0.4723 1.6006 1.2709 8.1479 1.4155 3.6981 1.6551 8.7619 2.8857 1.2888 1.1789 0.9750 6.3956 3.7538 4.2438 4.9170 12.9843 11.9787 1.9281 15.0516 7.9456 119.7753 3.0329 11.3433 4.3068 4.4333 28.4938 15.4716 35.1278 62.5097 10.2364 7.2875 118.7577 38.1233 5.1881 7.8781 4.1925 40.5049 9.9823 14.5570 85.8909 11.5726 2.8929 9.8947 0.5022 7.3349 11.3346 61.9263 74.7374 9.8187 106.2319 18.5341 8.3787 57.9572 3.3394 81.1810 61.4551 73.6661 85.6982 18.5902 8.2285 17.8090 40.0079 87.0546 10.9947 261.0953 33.4167 25.1387 165.7310 139.8018 33.1415 42.9685 6.4842 24.2545 23.1555 47.2792 12.6188 8.6294 5.0904 24.5932 8.0239 208.5094 41.5572 55.3970
temp: 298.150 k
press: 1.00000 atm
elementType: 17 8 8 7 7 7 6 6 6 6 6 6 6 6 6 6 1 1 1 1 1 1 1 1 1 1 1 1 1 1
symmnumber: 1
zpe: 614325.3 jmol-1
zpe.correction: 0.233984 hartree
zpe.thermalcorrener: 0.250547 hartree
zpe.thermalcorrenthalpy: 0.251491 hartree
zpe.thermalcorrgfe: 0.189939 hartree
zpe.sumelectzpe: -1163.025830 hartree
zpe.sumelectthermal: -1163.009267 hartree
zpe.sumelectthermalent: -1163.008323 hartree
zpe.sumelectthermalfe: -1163.069875 hartree
dipole: 0.4211 1.5020 -1.3254
dipole: 2.0470
quadrupole: -78.5727 -115.7288 -102.1362
quadrupole: 4.9275 5.9019 2.3422
quadrupole: 20.2399 -16.9162 -3.3237 4.9275 5.9019 2.3422
hfenergy: -1163.2598138 hartree
pointgroup: C01 [X(C10H14Cl1N3O2)]
dipole: 0.013178 -0.613062 -0.5220784 debye
polarizability: 188.9382887|16.3500286|178.1629651|-14.2779392|-2.6370862|90.591028 unknown
InChI: InChI=1S/C10H14ClN3O2/c1-5-8(12)7(4-16-3)9(10(11)13-5)14-6(2)15/h14H,4,12H2,1-3H3
charge 0 multiplicity 1
30 atoms
Cl 0.002085 3.379023 -0.014932
O  0.36479 -3.160355 -0.459709
O  2.85176 -0.66506 0.321156
N  1.60395 0.964912 -0.819536
N  -1.898825 1.443653 0.269793
N  -2.17151 -2.204576 -0.20784
C  -0.258537 -0.718352 -0.54147
C  -1.626951 -0.93012 -0.146705
C  0.270825 0.598297 -0.455318
C  0.495975 -1.875707 -1.186403
C  -2.427497 0.190422 0.25685
C  -0.629067 1.627238 -0.058384
C  -3.876167 0.024427 0.651175
C  2.800224 0.405382 -0.349501
C  1.088279 -3.198059 0.825963
C  4.041983 1.216159 -0.714198
H  0.037006 -2.099862 -2.168571
H  1.562294 -1.641999 -1.323955
H  1.678737 1.917028 -1.194467
H  -4.28205 1.001624 0.952751
H  -4.491417 -0.359763 -0.187635
H  -3.992974 -0.678792 1.500407
H  -1.518272 -2.993332 -0.310299
H  -3.142963 -2.360868 0.045931
H  2.16113 -2.99075 0.674643
H  0.934803 -4.217491 1.214474
H  0.68476 -2.450899 1.536951
H  3.993339 1.619394 -1.741441
H  4.929361 0.572625 -0.61984
H  4.156431 2.065801 -0.015387
