program: Gaussian 09
title: 000229808
version: EM64L-G09RevD.01
frameworkgroup: C1[X(C7H12O7)]
method: RPBEPBE
basis: SDD
operation: Freq
keyword: #pfreq=noraman
keyword: PBEPBE/SDD
title: #p freq=noraman PBEPBE/SDD
converged: YES YES NO NO
title: Mulliken charges:
elementType: O O O O O O O C C C C C C C H H H H H H H H H H H H
charge: -0.258608 -0.433975 -0.444794 -0.402358 -0.426787 -0.262905 -0.251220 -0.256352 -0.099235 0.103001 -0.087653 -0.403778 0.241163 -0.489575 0.294551 0.232499 0.264557 0.265695 0.229621 0.367424 0.358451 0.375155 0.335849 0.253533 0.251489 0.244251
chargesum: 0.00000
title: Mulliken charges with hydrogens summed into heavy atoms:
elementType: O O O O O O O C C C C C C C
charge: -0.258608 -0.066551 -0.086343 -0.027203 -0.090938 -0.262905 -0.251220 0.038199 0.133264 0.103001 0.176904 0.091539 0.241163 0.259698
polarizability: 1.15575515e+02 1.86949147e+00 9.16519637e+01 1.71109234e+00 -2.74945439e+00 8.47090886e+01
1716.lowfreq: -11.7033 0.0003 0.0007 0.0008 4.9835 10.1039 26.6722 50.5417 73.4739
frequency: 26.2636 50.5380 73.4614 80.6468 116.4227 166.3446 170.8229 226.0713 249.4665 263.9885 269.4590 308.6422 319.3128 359.5169 366.1088 384.0055 397.7826 410.0372 477.7904 484.0355 500.1901 524.0964 608.3644 615.0903 649.6333 682.1961 724.5967 767.9147 833.5295 889.7468 909.2902 924.1814 958.5377 963.9401 1013.9382 1045.3593 1050.4733 1056.0330 1092.4867 1104.0426 1114.6344 1152.2259 1178.6716 1201.2095 1216.0800 1248.0229 1259.5759 1275.1449 1285.9706 1330.3948 1338.9316 1348.1072 1369.9614 1383.4867 1397.5782 1424.6456 1454.3025 1460.1108 1461.0582 1626.4871 2943.5564 3005.4482 3015.3550 3070.3830 3080.3074 3111.9564 3123.1295 3164.1452 3440.0654 3503.3111 3528.2162 3539.3404
redmass: 5.5729 5.6463 2.2808 1.5713 3.5551 4.5761 5.0134 4.7694 5.6926 5.4131 6.8548 4.2298 5.0830 1.9333 2.2052 4.7643 3.0084 4.4336 1.2307 1.6393 2.2294 3.3737 4.1814 1.3569 3.1943 6.2154 4.7981 5.7337 3.7022 6.2901 5.2657 5.3037 4.5356 3.1279 4.5591 4.6384 4.2104 2.6973 2.9691 2.1330 1.2618 1.4585 1.2019 1.4071 1.8534 1.2484 1.7043 1.2670 1.5181 1.3100 1.4574 1.6756 1.1793 1.5498 1.1756 1.2035 1.0490 1.0830 1.0507 9.1554 1.0834 1.0648 1.0291 1.0855 1.0861 1.1015 1.1054 1.1057 1.0652 1.0648 1.0646 1.0659
irintensity: 1.9439 2.2279 0.2494 0.9850 2.0695 1.6845 4.4163 2.8911 12.9283 9.5206 13.0143 9.1747 6.4320 59.1107 49.4970 6.6296 31.1626 7.9338 73.3157 128.0641 45.0229 11.1818 16.9573 208.8849 62.5645 29.2264 51.5068 9.2609 34.3709 11.4445 24.4063 210.1321 119.2449 95.3935 31.8478 125.6078 14.5278 31.8996 15.3766 94.7283 0.1174 21.6810 59.5550 67.5569 126.2221 26.4876 10.5284 27.6277 101.5383 4.6516 12.0252 40.6334 28.5688 10.2142 25.1218 14.5149 17.5337 13.7926 12.2034 136.9181 32.6738 28.1685 22.1118 5.9449 13.9813 9.4238 17.2508 10.1210 61.8541 14.7556 24.1715 5.7685
temp: 298.150 k
press: 1.00000 atm
elementType: 8 8 8 8 8 8 8 6 6 6 6 6 6 6 1 1 1 1 1 1 1 1 1 1 1 1
symmnumber: 1
zpe: 521369.5 jmol-1
zpe.correction: 0.198579 hartree
zpe.thermalcorrener: 0.213364 hartree
zpe.thermalcorrenthalpy: 0.214309 hartree
zpe.thermalcorrgfe: 0.156494 hartree
zpe.sumelectzpe: -799.345319 hartree
zpe.sumelectthermal: -799.330534 hartree
zpe.sumelectthermalent: -799.329590 hartree
zpe.sumelectthermalfe: -799.387404 hartree
dipole: -5.5036 -1.7906 -0.0836
dipole: 5.7882
quadrupole: -78.2485 -84.5383 -83.7316
quadrupole: 2.4666 8.6365 -4.3745
quadrupole: 3.9243 -2.3655 -1.5588 2.4666 8.6365 -4.3745
hfenergy: -799.5438985 hartree
pointgroup: C01 [X(C7H12O7)]
dipole: -2.191172 0.4567338 -0.4195503 debye
dipolederiv: -0.9300564 -0.2030277 0.104295 -0.3350874 -0.6302542 0.0390857 0.1838616 0.1415211 -0.5341448 -0.6634485 -0.1574907 -0.0124672 -0.1147665 -0.4544833 0.2070876 0.0049649 0.2382454 -0.5845198 -0.6008584 0.1835408 -0.260028 0.1555575 -0.5078383 -0.0118761 -0.2804717 -0.0217747 -0.5336718 -0.5847246 -0.2838246 -0.020204 -0.3353296 -0.5559063 -0.1143289 -0.1042771 -0.277067 -0.6896227 -0.1957145 -0.0889396 -0.1047828 -0.2153076 -0.7655445 -0.0017175 -0.1276827 -0.0330792 -0.5812579 -1.4543074 0.291265 -0.119301 0.3003259 -0.3365933 -0.0062276 -0.2327859 0.0274586 -0.5212897 -0.6924953 0.1243226 0.056225 0.1115247 -0.3228613 -0.0677076 -0.3345377 0.0823465 -0.9059871 0.2446053 0.1386037 -0.1543597 0.0571243 0.2227537 -0.1168337 -0.045434 -0.1456271 0.3234573 0.3678593 -0.2562153 0.1590899 -0.2005822 0.2458238 -0.0061955 0.161177 0.0143223 0.2544495 0.5971752 0.3234432 0.0574909 0.5033626 0.835868 0.0860409 0.0747125 0.1410214 0.6032641 0.1918751 0.0052204 0.083648 0.2002977 0.6151027 0.0652014 -0.0067468 0.1267953 0.2799125 0.6189794 0.0922914 -0.1848956 -0.0396755 0.1285715 0.0466998 -0.092804 -0.0921426 0.2400112 1.4874806 -0.2757892 0.128846 -0.231201 0.1643969 0.0081075 0.5657129 -0.1210243 1.0170156 0.6462748 -0.1017175 -0.0593596 -0.1415232 0.3061261 0.0044174 -0.1606308 0.0298445 0.2304264 0.0326774 0.0265817 0.050174 0.0171943 0.0398213 -0.0521704 0.0365373 -0.0203129 0.0022993 -0.0378079 0.0809644 0.0444601 0.0802183 -0.0779769 -0.0403395 0.055511 -0.0653342 -0.0432519 -0.0484518 0.0304863 0.0562314 0.0236083 0.0249718 -0.0299015 0.017671 -0.0417197 0.0603808 0.0206316 -0.0073925 0.0167047 -0.0180451 -0.0095044 0.1179297 0.0396881 0.0777207 0.0230585 -0.0268105 -0.0280817 0.0153478 0.0522084 -0.0424546 -0.1489154 0.021731 -0.0827555 0.0115985 0.430669 -0.0011903 0.0744516 -0.0477482 0.2396506 -0.1302425 0.0586245 -0.0795117 0.2910466 0.3229013 -0.0927062 0.1313663 -0.0347234 0.2460777 0.095763 0.1204753 0.0924242 0.2736714 0.2427574 0.1102582 -0.0870329 0.120065 0.2536705 0.0564244 -0.1113348 0.0399041 0.369834 0.0370278 0.0914203 0.0859892 0.061338 0.3274048 -0.0255586 0.0898346 -0.0264541 0.3165004 0.0078644 -0.0603205 -0.0184208 0.0123127 -0.0471447 -0.0662394 0.0599474 -0.0877944 0.0659941 0.0153424 0.0241707 0.0164262 -0.0126672 -0.0177882 0.0902569 0.1132311 0.0681564 0.0195297 -0.0294455 0.0341268 -0.0598943 0.0315193 0.1181108 0.0012399 -0.1069748 0.0148368 0.0112956 unknown
polarizability: 115.7193687|-1.4917655|85.5185879|-0.2718382|-3.6151623|90.6986104 unknown
InChI: InChI=1S/C7H12O7/c1-13-6(11)7(12)5(10)4(9)3(8)2-14-7/h3-5,8-10,12H,2H2,1H3
charge 0 multiplicity 1
26 atoms
O  0.064503 0.741989 -1.126855
O  0.415222 -2.064252 1.351867
O  3.036985 -0.999106 1.207159
O  -0.818576 -1.453379 -1.544724
O  2.727054 2.022914 -0.033224
O  -2.654427 0.117974 -0.288187
O  -1.386814 0.046556 1.661802
C  0.823227 -1.24396 0.206715
C  1.912323 -0.239555 0.664691
C  -0.358761 -0.543893 -0.528299
C  2.447471 0.652529 -0.485073
C  1.453554 0.650793 -1.659511
C  -1.493898 -0.100872 0.419497
C  -3.832866 0.58609 0.490265
H  1.261069 -1.970066 -0.499061
H  1.469463 0.41385 1.449795
H  3.429403 0.264976 -0.801327
H  1.584097 1.550073 -2.280504
H  1.544889 -0.255693 -2.288082
H  -0.104287 -1.479818 1.972828
H  2.653281 -1.698732 1.801762
H  -1.634089 -1.0676 -1.962759
H  1.87139 2.436476 0.252474
H  -3.591981 1.536837 0.992392
H  -4.107709 -0.172786 1.240804
H  -4.626221 0.717756 -0.257042
