program: Gaussian 09
title: 000229807
version: EM64L-G09RevD.01
frameworkgroup: C1[X(C7H11ClN2O2)]
method: RPBEPBE
basis: SDD
operation: Freq
keyword: #p
keyword: freq=noraman
keyword: PBEPBE/SDD
title: #p freq=noraman PBEPBE/SDD
converged: NO YES NO NO
title: Mulliken charges:
elementType: Cl O O N N C C C C C C C H H H H H H H H H H H
charge: -0.082986 -0.210713 -0.231450 -0.399739 -0.399579 -0.160251 -0.358537 -0.345248 -0.352810 0.161287 0.186604 -0.591427 0.265991 0.212789 0.232870 0.185897 0.222916 0.236156 0.213130 0.333055 0.353097 0.257006 0.271943
chargesum: 0.00000
title: Mulliken charges with hydrogens summed into heavy atoms:
elementType: Cl O O N N C C C C C C C
charge: -0.082986 -0.210713 -0.231450 -0.066684 -0.046482 0.105741 0.087122 0.063565 0.096476 0.161287 0.186604 -0.062478
polarizability: 1.23229447e+02 -7.39124451e+00 1.00734750e+02 7.41472075e+00 -2.49313946e+00 7.84051737e+01
1716.lowfreq: -7.2991 -3.5205 -0.0032 -0.0025 -0.0015 4.8441 25.2096 42.7458 63.8472
frequency: 24.7611 42.5555 63.7993 93.9871 125.7838 146.9161 161.2029 204.7237 258.9891 289.3700 380.8272 421.1603 448.9612 476.2886 559.5477 597.4133 603.4023 633.4238 662.7689 692.5535 725.8262 749.8687 808.9732 868.9315 880.7839 955.4420 969.7499 1006.9542 1054.4787 1057.7796 1098.2347 1106.9786 1143.4753 1174.0619 1180.1997 1221.4879 1252.8362 1277.0256 1284.6773 1302.5687 1308.0722 1315.2344 1339.1046 1343.5383 1365.5725 1373.8164 1446.4727 1452.0542 1458.5300 1477.0771 1686.0755 1727.6160 2960.5350 2963.8541 2974.1404 2988.6794 3018.4418 3038.2613 3052.2233 3060.3812 3132.7875 3591.5575 3615.9575
redmass: 7.5091 5.1897 6.1269 4.4711 2.0270 4.5600 7.0575 2.6271 3.7880 3.6696 8.5023 3.5811 1.9149 1.4404 3.4501 4.2249 10.9336 2.1031 1.8311 4.1296 6.1215 1.2460 1.9247 2.2825 1.7890 2.9730 3.0884 2.0527 3.0342 1.5530 2.0587 2.5151 1.3697 1.8075 1.7022 1.7763 1.3043 1.5910 1.1919 1.2379 1.4534 1.6386 1.5968 1.8128 1.6683 1.7243 1.0811 1.1004 1.0754 1.0969 8.4675 9.6434 1.0612 1.0650 1.0811 1.0623 1.0931 1.0930 1.0670 1.1004 1.1110 1.0803 1.0800
irintensity: 2.8363 2.4278 1.1903 0.0982 0.3325 4.2526 0.3842 4.0157 0.3493 10.6731 12.1456 6.5551 46.3067 61.9622 13.6775 22.9977 12.5732 73.6584 68.4572 3.0676 67.2962 25.1416 1.2670 15.1404 6.9423 19.6175 2.2317 7.4169 0.7467 8.8595 19.5243 8.2777 7.6820 62.7336 23.1503 70.1255 9.3940 37.7442 7.3793 18.3565 36.8145 56.6505 68.4628 43.3685 4.4506 2.9607 5.6872 7.2432 4.0032 14.9658 584.3372 371.0310 10.2316 31.9202 10.7525 22.4616 5.4062 3.1722 19.2527 65.7104 18.1378 73.0646 39.6671
temp: 298.150 k
press: 1.00000 atm
elementType: 17 8 8 7 7 6 6 6 6 6 6 6 1 1 1 1 1 1 1 1 1 1 1
symmnumber: 1
zpe: 476704.4 jmol-1
zpe.correction: 0.181567 hartree
zpe.thermalcorrener: 0.193954 hartree
zpe.thermalcorrenthalpy: 0.194898 hartree
zpe.thermalcorrgfe: 0.140377 hartree
zpe.sumelectzpe: -992.469788 hartree
zpe.sumelectthermal: -992.457401 hartree
zpe.sumelectthermalent: -992.456457 hartree
zpe.sumelectthermalfe: -992.510978 hartree
dipole: -2.1925 -0.6605 1.7103
dipole: 2.8581
quadrupole: -93.8503 -91.8420 -75.3002
quadrupole: 6.7466 -8.7283 1.2794
quadrupole: -6.8528 -4.8445 11.6973 6.7466 -8.7283 1.2794
hfenergy: -992.651355 hartree
pointgroup: C01 [X(C7H11Cl1N2O2)]
dipole: -0.8952886 -0.3059785 0.6076495 debye
dipolederiv: -0.343986 -0.0073343 -0.1277066 0.0174647 -0.2001964 0.0542666 -0.2206183 0.0141807 -0.4965704 -0.5223156 -0.0533665 -0.0213388 -0.0202338 -1.1860136 -0.0226137 -0.0329327 -0.0733158 -0.349889 -0.9017191 0.3616085 -0.0652679 0.5356283 -1.0430008 0.0425824 -0.1055014 0.0477354 -0.3777768 -1.1875067 0.1319134 -0.0561233 0.1634119 -0.458339 0.0182902 -0.021092 0.0014911 -0.5110609 -0.6714779 0.3943832 -0.0044977 0.1422977 -1.4102298 -0.0356781 -0.0793981 0.0238442 -0.3591291 -0.1386491 -0.2811219 -0.0959018 -0.4913896 0.2855256 -0.0855967 -0.1621612 -0.0747604 0.3175709 0.0966341 0.0313275 0.0261023 -0.0024438 0.0392061 -0.0232038 -0.0112079 -0.0602187 0.0968481 -0.0257662 -0.0445053 0.0457264 0.0062068 0.138253 -0.0670102 0.0858826 -0.0452554 0.0478162 -0.0572134 -0.0502924 -0.0236863 -0.0800286 0.0643589 0.0040264 -0.1735945 -0.026789 -0.0046385 1.0241976 -0.4294697 0.1218779 -0.0858924 1.602347 0.0221273 0.2609482 0.0091151 0.231383 1.6915164 -0.2344484 0.2520564 -0.4340133 1.8547104 0.0222541 0.3243014 0.0478694 0.3556411 0.3047982 -0.0239606 0.2404634 0.0053879 0.2199151 -0.0588662 0.3413468 -0.0668936 0.6420358 0.060922 0.0405229 -0.0539784 0.0742047 0.0066349 0.0254588 -0.037602 0.051307 -0.0766382 0.0133596 -0.0004572 -0.0403797 -0.0082176 0.0657547 0.0632878 -0.0414655 0.0289756 -0.1173808 0.0367336 0.0397582 0.0038462 0.045441 -0.0917259 -0.003135 0.0072033 0.0067233 0.0817652 0.0440018 0.03929 0.0112511 0.0340566 -0.1846413 -0.0110605 0.0029398 0.0056888 0.0600214 0.0852244 -0.000503 -0.018926 0.0028602 0.0609616 0.043989 -0.006298 0.0229709 -0.1133387 0.0391872 0.00609 0.0094493 0.0304109 -0.1303339 -0.0238887 0.0364898 0.0253703 0.0974611 0.0165446 0.0022832 -0.1086345 -0.0217455 0.0845297 0.0332639 -0.0083501 0.0389214 -0.1340377 0.2284454 -0.0079911 -0.0553866 0.0099668 0.154563 -0.0032951 -0.0919403 0.0127271 0.3444123 0.240213 0.0065827 -0.0320044 0.0450168 0.1577321 -0.0092068 -0.0457527 -0.0141267 0.3578978 0.0737188 0.0583453 -0.0525027 -0.0054384 -0.1179147 0.0272253 -0.0669098 0.0203423 -0.0167988 -0.1068626 0.0213452 0.0455615 0.0370487 0.0879033 -0.013217 0.0457126 0.0040969 -0.0755939 unknown
polarizability: 122.3692894|-7.9750703|101.0525898|9.0350249|-1.2174126|78.9474911 unknown
InChI: InChI=1S/C7H11ClN2O2/c8-4-2-1-3-5-6(11)10-7(12)9-5/h5,9-10H,1-4H2
charge 0 multiplicity 1
23 atoms
Cl -4.872778 -0.070085 -1.195407
O  1.973837 2.426245 0.021842
O  3.312409 -2.101269 0.051376
N  1.227141 -1.040245 -0.410728
N  2.966691 0.268849 0.120966
C  0.688896 0.329998 -0.475898
C  -0.511784 0.609583 0.458138
C  -1.791225 -0.142685 0.033288
C  -3.002773 0.236253 0.912453
C  1.927668 1.179639 -0.090412
C  2.57348 -1.098221 -0.07222
C  -4.291736 -0.505049 0.561243
H  0.401437 0.592465 -1.515249
H  -0.232151 0.341997 1.495903
H  -0.689059 1.702452 0.439472
H  -1.629432 -1.239351 0.096902
H  -2.030475 0.08745 -1.023509
H  -3.178868 1.327701 0.859185
H  -2.774865 0.004256 1.975322
H  0.705978 -1.881937 -0.645122
H  3.916702 0.522324 0.392718
H  -4.167164 -1.599376 0.55386
H  -5.132831 -0.217892 1.209679
