program: Gaussian 09
title: 000229784
version: EM64L-G09RevD.01
frameworkgroup: C1[X(C12H24O2)]
method: RPBEPBE
basis: SDD
operation: Freq
keyword: #pfreq=noraman
keyword: PBEPBE/SDD
title: #p freq=noraman PBEPBE/SDD
converged: YES YES NO NO
title: Mulliken charges:
elementType: O O C C C C C C C C C C C C H H H H H H H H H H H H H H H H H H H H H H H H
charge: -0.286934 -0.255914 -0.374376 -0.362752 -0.379250 -0.352431 -0.533739 -0.355951 0.058405 0.268490 -0.374897 -0.696022 -0.707415 -0.690423 0.184621 0.215356 0.182957 0.193462 0.201567 0.222161 0.185418 0.189398 0.239370 0.236845 0.196157 0.193669 0.225548 0.210213 0.193255 0.214827 0.210335 0.208948 0.211755 0.249934 0.218923 0.215547 0.208374 0.234570
chargesum: 0.00000
title: Mulliken charges with hydrogens summed into heavy atoms:
elementType: O O C C C C C C C C C C C C
charge: -0.286934 -0.255914 0.025601 0.013666 0.044478 0.022384 -0.057524 0.033875 0.283953 0.268490 0.028571 -0.061912 -0.026803 -0.031932
polarizability: 1.66486485e+02 2.24380090e+00 1.31138273e+02 -4.47315276e+00 8.31101705e-01 1.15101492e+02
1716.lowfreq: -16.3828 -9.2936 -7.5959 -6.4818 -0.0003 0.0004 0.0006 21.8428 40.9714
frequency: -10.9727 21.1901 40.7222 54.3034 62.3724 74.6304 95.6502 110.8795 116.6397 134.5257 154.1840 197.6716 208.9860 222.7019 232.3205 234.6119 250.5073 284.1713 349.8102 386.7575 403.6133 428.4285 472.3502 502.8994 562.1464 644.5566 722.7623 735.7957 744.4891 784.7408 812.1211 835.9907 852.6625 870.6223 893.3858 905.3140 965.2825 981.1969 993.2187 999.9292 1026.2495 1036.4145 1055.1861 1077.3309 1082.4160 1094.5550 1108.9828 1115.5742 1127.5438 1149.8291 1180.2055 1192.1868 1200.2440 1240.3975 1250.1256 1261.4109 1280.4471 1286.3147 1291.7793 1294.1030 1297.1567 1323.9996 1333.3675 1347.4950 1352.6292 1357.9958 1359.9297 1385.2672 1387.9909 1388.7850 1440.8242 1452.6850 1455.5517 1461.7641 1464.2612 1465.9537 1472.4688 1474.8724 1477.2128 1478.6805 1480.9909 1486.9638 1487.7070 1632.9123 2950.7686 2953.7797 2960.3845 2967.2570 2971.0982 2979.3957 2981.3673 2984.2106 2987.1489 2989.8497 2991.9932 3001.0368 3013.1933 3017.2963 3033.5377 3040.1023 3048.5601 3063.1758 3067.8591 3069.7322 3075.8569 3084.8670 3090.4539 3101.1800
redmass: 3.9563 3.4551 1.5685 4.3915 3.6556 3.5158 2.9152 1.6416 2.0906 2.3000 2.6431 1.9402 1.0630 1.9830 1.1302 1.6882 2.9921 3.9074 3.4063 3.0142 2.5481 2.8367 2.7947 3.2423 3.3627 2.6970 1.0714 1.2867 1.6047 1.3778 1.6946 2.2928 2.0345 1.9197 1.9027 1.6370 1.2752 1.5217 1.4041 2.5515 2.4484 3.1819 2.8745 2.1256 1.9331 2.4525 1.7474 2.2998 2.2228 2.4796 1.9645 1.5155 1.4316 1.3166 1.3223 1.2278 1.1914 1.0651 1.2524 1.2822 1.1349 1.2284 1.4013 1.5726 1.6324 1.7076 1.5863 1.2236 1.2162 1.2151 1.0919 1.0749 1.0783 1.0679 1.0766 1.0567 1.0770 1.0442 1.0425 1.0466 1.0794 1.0543 1.0866 9.4340 1.0587 1.0589 1.0603 1.0590 1.0366 1.0631 1.0398 1.0525 1.0950 1.0402 1.0642 1.0978 1.0867 1.1017 1.1037 1.0993 1.1018 1.0978 1.1007 1.0993 1.0996 1.0988 1.1000 1.1005
irintensity: 0.3909 0.0436 0.0601 1.5441 0.0410 0.8763 0.2485 0.1015 0.7554 0.3689 3.7817 1.0248 0.1718 1.1900 0.2648 2.3616 1.8004 4.3344 5.5481 4.2947 0.4419 1.0517 1.0768 1.1382 5.1450 0.1923 13.9221 0.5442 1.3487 6.3433 16.7809 1.3576 8.1494 20.2678 0.3513 13.2093 8.6008 4.7537 44.3513 15.4452 22.6262 11.5514 2.7183 1.5571 8.2119 208.1876 7.8992 24.9351 18.9007 166.2636 0.8693 27.6903 2.8219 4.7789 3.0563 0.5102 3.8097 1.2517 1.0119 1.9906 3.2895 21.4647 0.0238 27.4668 1.3147 2.5163 0.3116 16.3074 11.2411 22.4208 26.4904 2.5298 6.9605 0.3180 1.7446 13.7888 2.0132 8.3156 12.4442 14.4642 4.6131 10.9940 22.0069 145.4750 0.5676 3.5962 16.6821 109.5134 35.2881 41.1574 36.1395 11.5343 3.1082 34.7718 35.4023 4.1420 6.8122 0.9237 49.1326 14.4405 48.4758 36.3902 103.5350 56.3940 44.8337 26.3930 61.6305 22.7815
temp: 298.150 k
press: 1.00000 atm
elementType: 8 8 6 6 6 6 6 6 6 6 6 6 6 6 1 1 1 1 1 1 1 1 1 1 1 1 1 1 1 1 1 1 1 1 1 1 1 1
symmnumber: 1
zpe: 887551.4 jmol-1
zpe.correction: 0.338050 hartree
zpe.thermalcorrener: 0.355649 hartree
zpe.thermalcorrenthalpy: 0.356593 hartree
zpe.thermalcorrgfe: 0.290836 hartree
zpe.sumelectzpe: -620.973775 hartree
zpe.sumelectthermal: -620.956176 hartree
zpe.sumelectthermalent: -620.955232 hartree
zpe.sumelectthermalfe: -621.020989 hartree
dipole: 0.9323 0.1160 -1.4775
dipole: 1.7509
quadrupole: -82.0395 -84.8306 -93.1379
quadrupole: 4.0710 0.0286 1.2718
quadrupole: 4.6298 1.8387 -6.4685 4.0710 0.0286 1.2718
hfenergy: -621.3118251 hartree
pointgroup: C01 [X(C12H24O2)]
dipole: -0.3604138 0.1546979 0.5662869 debye
polarizability: 166.2063103|-4.2796816|130.6939451|-4.2430758|-3.2460858|115.8259951 unknown
InChI: InChI=1S/C12H24O2/c1-4-6-7-8-9-10-12(13)14-11(3)5-2/h11H,4-10H2,1-3H3
charge 0 multiplicity 1
38 atoms
O  -2.428026 0.162356 0.481156
O  -1.162117 -0.369271 -1.406766
C  1.685186 -0.535478 0.501996
C  3.147993 -0.826515 0.098304
C  0.760448 -1.762263 0.338464
C  4.075099 0.400857 0.245321
C  -0.700825 -1.485571 0.756036
C  5.539212 0.11537 -0.160957
C  -3.254245 1.133375 -0.328916
C  -1.412564 -0.5253 -0.187769
C  -4.616565 1.209381 0.375622
C  6.45634 1.349027 -0.016053
C  -2.507435 2.472886 -0.391972
C  -5.393257 -0.12324 0.357242
H  1.657958 -0.18816 1.556441
H  1.297257 0.297384 -0.118386
H  3.542563 -1.660509 0.716569
H  3.171428 -1.18001 -0.953559
H  1.14975 -2.601967 0.947868
H  0.774144 -2.091945 -0.718072
H  4.051075 0.757623 1.296622
H  3.680569 1.233544 -0.373956
H  -1.280955 -2.431016 0.75297
H  -0.762238 -1.083652 1.783223
H  5.561262 -0.243225 -1.210377
H  5.933892 -0.715495 0.459244
H  -3.3534 0.704296 -1.344819
H  -4.456674 1.543305 1.419278
H  -5.208519 2.000246 -0.126833
H  7.496539 1.11936 -0.312362
H  6.100436 2.183278 -0.649839
H  6.47435 1.708404 1.030393
H  -3.095413 3.207132 -0.97287
H  -1.528823 2.350932 -0.885637
H  -2.349393 2.878608 0.623198
H  -6.364534 -0.023792 0.874648
H  -5.594174 -0.454334 -0.679097
H  -4.814945 -0.916124 0.862746
