program: Gaussian 09
title: 000021730
version: EM64L-G09RevD.01
frameworkgroup: C1[X(C15H22N2S)]
method: RPBEPBE
basis: SDD
operation: Freq
keyword: #p
keyword: freq=noraman
keyword: PBEPBE/SDD
title: #p freq=noraman PBEPBE/SDD
converged: YES YES NO NO
title: Mulliken charges:
elementType: S N N C C C C C C C C C C C C C C C H H H H H H H H H H H H H H H H H H H H H H
charge: 0.159274 -0.105346 -0.413606 -0.193016 -0.005379 0.389539 0.093928 -0.770712 -0.794605 -0.435420 0.228717 -0.636865 -0.632326 -0.407639 -0.345827 -0.258139 -0.204612 -0.843806 0.217928 0.212436 0.209091 0.212189 0.253835 0.228378 0.224257 0.246294 0.267349 0.303567 0.259045 0.246498 0.189790 0.214804 0.214819 0.191659 0.231258 0.229578 0.247939 0.250219 0.261906 0.263001
chargesum: 0.00000
title: Mulliken charges with hydrogens summed into heavy atoms:
elementType: S N N C C C C C C C C C C C C C C C
charge: 0.159274 -0.105346 -0.110040 0.024912 0.207057 0.389539 0.093928 -0.095597 -0.095676 -0.168071 0.228717 0.014226 0.005410 -0.148594 -0.116249 -0.258139 0.043327 -0.068679
polarizability: 2.38542123e+02 1.86051782e+01 2.16064739e+02 6.98080941e+00 -5.08608592e+00 1.34890196e+02
1716.lowfreq: -7.1193 -0.0017 0.0018 0.0019 4.5856 9.0663 27.3419 30.0132 39.8057
frequency: 27.2022 29.8934 39.6927 49.6724 69.0038 91.0927 118.5094 136.8174 172.7097 183.8255 190.3394 209.1267 229.8977 234.2404 248.5484 274.2346 290.8373 295.2641 305.7299 332.4735 358.6434 376.3732 389.8377 429.0145 439.7917 485.7579 499.5331 510.0192 578.1225 591.6360 598.2092 639.1368 640.9680 664.4716 728.9832 746.1934 772.1550 779.5882 805.3455 811.7634 832.5854 878.7462 896.0047 939.4753 941.4904 963.0017 976.2366 985.3293 998.0019 1030.0661 1034.9193 1052.8510 1064.9513 1084.8355 1087.1231 1097.7433 1121.4679 1135.9079 1137.6885 1148.8103 1216.0530 1229.8763 1243.4064 1248.8753 1261.8440 1275.2893 1290.1459 1313.7928 1337.7296 1341.8951 1351.3090 1379.2372 1382.9039 1389.1734 1413.8827 1418.5265 1440.6993 1444.7043 1445.3638 1456.2965 1460.0493 1464.8573 1466.9769 1468.8826 1477.4010 1482.1039 1485.4893 1495.6337 1501.2246 1556.4847 1573.8743 1621.5102 2827.0650 2843.5216 2860.5260 2978.1071 2982.6471 2988.9830 3004.8446 3029.3822 3032.2456 3071.2710 3081.1775 3086.2678 3087.4716 3091.9430 3096.7625 3127.3755 3129.5722 3131.3237 3144.7352 3157.4370 3227.1687 3612.9110
redmass: 2.7799 3.1502 4.3614 2.9585 3.6433 3.9280 3.0598 1.1451 2.8288 2.1720 2.9067 1.2457 1.4090 1.7430 1.6022 1.9733 1.6670 3.0193 4.6233 3.7664 6.4965 2.0131 5.3707 2.8572 2.6139 2.3142 2.6928 1.4256 3.1811 2.8785 3.9069 4.2503 5.8442 4.3156 4.6732 3.4574 2.7339 4.1834 1.6244 1.5255 2.4754 5.4222 1.4424 2.1702 1.3320 1.1738 2.1578 1.2811 1.4759 1.5966 1.8412 1.7429 2.1578 1.7959 1.3409 1.5933 1.8815 2.1852 1.4441 1.8363 2.7582 2.0697 1.9013 1.9182 1.6725 1.5045 2.1234 1.4955 1.1353 1.4551 1.5383 1.2474 1.2948 4.0759 2.1343 1.1539 1.7361 1.1670 1.6505 4.2974 1.0598 1.0616 1.0484 1.0558 1.0553 1.0468 1.0492 1.0508 1.0511 6.2192 6.2053 6.9922 1.0803 1.0573 1.0580 1.0804 1.0364 1.0363 1.0278 1.0725 1.0732 1.0990 1.1002 1.0995 1.0992 1.0994 1.0980 1.1057 1.1038 1.0881 1.0920 1.0967 1.0978 1.0809
irintensity: 0.7919 1.5217 1.0523 0.6558 0.3995 3.0042 0.3246 0.1766 0.7800 2.0339 3.1313 0.2307 0.1461 0.5547 1.3881 0.6933 0.6654 2.0440 0.4739 5.1463 1.1208 0.4240 0.9416 11.4258 0.1960 4.7187 26.7117 68.2606 3.0737 17.1053 2.4304 5.7203 2.4653 9.3263 2.4550 1.1508 7.7619 5.7674 64.6847 0.3624 3.7521 13.6470 12.2809 14.5909 0.2091 4.2956 14.0672 26.8067 9.6980 9.6025 7.5240 20.9378 9.3304 21.9508 8.5167 37.8238 28.9848 7.1368 0.0963 1.5223 16.6928 17.7603 2.8656 2.8515 1.5312 18.0069 0.8035 7.4993 0.7141 16.6446 4.8342 28.9152 49.3663 18.4593 5.9331 1.9985 20.3733 8.1802 5.3670 41.0038 15.5005 14.4102 3.4851 7.4453 8.1717 34.7270 7.6490 7.1042 12.6665 1.7536 2.1928 1.1433 66.4952 77.6500 169.0852 18.3830 27.6161 23.7799 37.2989 22.0561 72.8068 41.4818 32.6449 46.8927 24.7644 22.7389 23.3840 17.2141 17.6983 8.1338 7.0597 11.8566 1.4552 64.6914
temp: 298.150 k
press: 1.00000 atm
elementType: 16 7 7 6 6 6 6 6 6 6 6 6 6 6 6 6 6 6 1 1 1 1 1 1 1 1 1 1 1 1 1 1 1 1 1 1 1 1 1 1
symmnumber: 1
zpe: 887091.5 jmol-1
zpe.correction: 0.337875 hartree
zpe.thermalcorrener: 0.357645 hartree
zpe.thermalcorrenthalpy: 0.358589 hartree
zpe.thermalcorrgfe: 0.288671 hartree
zpe.sumelectzpe: -1090.974404 hartree
zpe.sumelectthermal: -1090.954634 hartree
zpe.sumelectthermalent: -1090.953690 hartree
zpe.sumelectthermalfe: -1091.023608 hartree
dipole: 0.3296 2.7892 0.9766
dipole: 2.9736
quadrupole: -116.2506 -99.1817 -119.9405
quadrupole: -6.3851 -6.3148 -5.0164
quadrupole: -4.4596 12.6092 -8.1496 -6.3851 -6.3148 -5.0164
hfenergy: -1091.3122792 hartree
pointgroup: C01 [X(C15H22N2S1)]
dipole: 0.0501987 -1.0529793 0.5073393 debye
polarizability: 231.9886194|20.2748895|222.4786035|-9.489596|-6.0180604|135.0298357 unknown
InChI: InChI=1S/C15H22N2S/c1-10(11(2)17(3)4)14-9-16-15-7-6-12(18-5)8-13(14)15/h6-11,16H,1-5H3
charge 0 multiplicity 1
40 atoms
S  3.070323 2.752712 -0.751878
N  -3.553695 1.145712 -0.12511
N  1.025878 -2.807543 0.321157
C  -1.806804 -0.382498 0.882042
C  -2.438823 0.196735 -0.442674
C  -0.52482 -1.138594 0.593279
C  0.744095 -0.547561 0.18749
C  -2.834994 -1.202769 1.692364
C  -2.913384 -0.941446 -1.372836
C  -0.305358 -2.514885 0.665427
C  1.695202 -1.617645 0.023714
C  -4.310126 1.583801 -1.321513
C  -3.104811 2.324794 0.651385
C  1.172062 0.788742 -0.036976
C  3.033437 -1.38855 -0.367088
C  2.507154 1.022356 -0.418096
C  3.428335 -0.054962 -0.590884
C  3.86515 3.152083 0.920344
H  -1.515025 0.488664 1.50304
H  -1.619196 0.750598 -0.97407
H  -3.111741 -2.138867 1.173189
H  -2.431034 -1.470596 2.685611
H  -3.757354 -0.611459 1.823347
H  -3.84966 -1.391845 -0.996888
H  -3.086129 -0.587244 -2.403354
H  -2.138849 -1.726282 -1.41848
H  -0.9926 -3.30977 0.947582
H  1.438297 -3.737291 0.306644
H  0.485285 1.633303 0.081996
H  -4.796876 0.725352 -1.810031
H  -3.675064 2.105083 -2.083055
H  -5.105091 2.283322 -1.006586
H  -3.953516 3.020316 0.774541
H  -2.269927 2.8846 0.155658
H  -2.770845 2.034927 1.661775
H  3.74526 -2.210671 -0.500816
H  4.450487 0.168787 -0.913545
H  4.263208 4.176493 0.840601
H  4.684316 2.445657 1.125058
H  3.107934 3.101343 1.717636
