program: Gaussian 09
title: 000229748
version: EM64L-G09RevD.01
frameworkgroup: C1[X(C18H26Cl2N2O2)]
method: RPBEPBE
basis: SDD
operation: Freq
keyword: #p
keyword: freq=noraman
keyword: PBEPBE/SDD
title: #p freq=noraman PBEPBE/SDD
converged: YES YES NO NO
title: Mulliken charges:
elementType: Cl Cl O O N N C C C C C C C C C C C C C C C C C C H H H H H H H H H H H H H H H H H H H H H H H H H H
charge: -0.013632 -0.013875 -0.251514 -0.251356 -0.150317 -0.150608 -0.020221 -0.020711 -0.607065 -0.605754 0.510015 0.506924 -0.373157 -0.448626 -0.451167 -0.372571 -0.696863 -0.682975 -0.696934 -0.682768 0.320007 0.319750 -0.740229 -0.740155 0.208480 0.208538 0.251071 0.254527 0.251131 0.254626 0.250951 0.238554 0.238638 0.251299 0.272081 0.222102 0.209968 0.268275 0.205465 0.213549 0.272196 0.221841 0.210056 0.268229 0.205431 0.213574 0.281245 0.280107 0.281572 0.280295
chargesum: 0.00000
title: Mulliken charges with hydrogens summed into heavy atoms:
elementType: Cl Cl O O N N C C C C C C C C C C C C C C C C C C
charge: -0.013632 -0.013875 -0.251514 -0.251356 -0.150317 -0.150608 0.188259 0.187827 -0.101467 -0.099996 0.510015 0.506924 -0.122206 -0.210072 -0.212529 -0.121273 0.007288 0.004314 0.007159 0.004467 0.320007 0.319750 -0.178877 -0.178288
polarizability: 3.06298292e+02 -1.27567195e-01 1.98383591e+02 -1.67646635e+01 -8.33720973e-02 1.99772956e+02
1716.lowfreq: -10.9213 -3.4668 -1.7354 -0.0020 -0.0019 -0.0006 8.7614 12.7866 14.1497
frequency: 8.5742 12.7516 13.5541 33.2995 36.8295 41.3478 45.1047 64.4031 85.6543 97.5540 113.1919 114.1439 120.2366 134.5782 151.8248 179.9521 190.3001 216.0103 220.7323 232.1038 239.3285 241.7633 249.9662 266.8919 273.6144 280.8592 322.3503 332.4677 351.3263 361.2922 407.2305 414.1618 431.5043 450.7567 451.9277 469.5658 470.0760 476.8364 554.2735 562.2730 567.3259 630.1661 650.4097 674.6988 695.3023 717.3618 725.3779 754.3388 758.2879 762.7057 814.5725 831.2648 851.1471 855.8590 858.3740 916.0655 918.4533 923.9928 925.8459 926.2384 927.9658 945.2599 945.5668 953.0999 982.4700 998.3237 999.1306 1012.7234 1121.3320 1123.1117 1123.4833 1143.9307 1145.1453 1145.2733 1145.7966 1159.7448 1160.2211 1185.1790 1195.0415 1195.5625 1198.7688 1200.7036 1223.9581 1224.9520 1263.5792 1264.3540 1295.8829 1311.9799 1313.5536 1314.7981 1333.5306 1335.2428 1356.2346 1375.5272 1375.9196 1389.5146 1389.8005 1390.3299 1410.8062 1421.0599 1423.3427 1429.7765 1431.3466 1457.8815 1458.1033 1471.0704 1471.3749 1479.1410 1480.6432 1482.2290 1482.3932 1498.1348 1498.1907 1507.4135 1586.3058 1607.0269 1609.0801 1624.5692 2981.0962 2981.3100 2985.4021 2985.4497 2991.4548 2991.5192 2999.8596 2999.9547 3031.5043 3031.6283 3040.7703 3041.5870 3075.3338 3075.3714 3082.3464 3082.5030 3110.6082 3110.7385 3110.8047 3111.2928 3115.8612 3116.3006 3120.4919 3120.9850 3141.8940 3146.3110
redmass: 8.1916 7.6668 7.7075 4.0758 4.6454 4.1879 3.9575 3.9408 3.9341 4.0961 2.8593 3.0563 4.2137 4.2196 4.7463 3.3257 2.4630 1.2531 1.3173 3.5810 1.1705 1.1820 4.0902 5.6383 4.0367 3.1627 2.8713 3.2838 3.8515 3.1506 2.8907 3.1549 3.1141 2.3861 2.6795 3.1987 3.1897 3.0202 3.6012 3.2375 3.9381 6.4499 4.7981 4.4719 3.5801 3.8158 4.5671 4.9102 4.6966 4.5099 2.1111 2.6152 2.9257 2.9148 1.2452 2.2156 2.2110 1.8315 1.1893 1.1881 2.0257 1.4496 1.4517 1.5199 1.3773 1.9803 2.0341 2.7319 1.9257 2.3250 1.5381 2.2391 2.3487 2.3636 2.1376 1.1516 1.1636 1.5414 1.7414 1.9085 2.1464 1.8074 2.3894 2.0705 1.2665 1.2691 1.3334 1.5479 1.3695 1.5506 1.6627 1.6306 1.2708 1.2099 1.2086 3.1417 1.2961 1.2250 2.3494 1.5083 1.3605 1.2252 1.3722 1.0424 1.0421 1.0654 1.0630 1.1361 1.0866 1.0532 1.0529 1.0608 1.0606 2.2901 6.6391 7.6083 7.5784 6.1735 1.0661 1.0659 1.0379 1.0379 1.0445 1.0445 1.0742 1.0739 1.0596 1.0601 1.0917 1.0919 1.0996 1.0996 1.0989 1.0989 1.0997 1.1037 1.1041 1.1081 1.0883 1.0879 1.0990 1.0989 1.0946 1.0959
irintensity: 1.9169 0.8100 2.3984 0.1671 0.0363 1.5759 0.0952 0.2669 1.0340 3.7825 0.0229 10.4018 1.3275 5.8732 0.6877 0.2598 0.0001 0.3547 0.0099 0.1539 0.2644 0.1122 0.0289 1.4973 7.2519 1.2643 3.3742 0.8734 0.0778 4.1708 0.0030 0.2397 6.5291 0.5784 5.6912 3.3545 3.0334 24.9095 5.1992 14.8202 1.8747 0.2232 12.9233 0.8866 14.1296 20.9609 32.1253 2.2155 25.8588 44.1044 22.9246 12.2514 0.0189 4.9804 0.5961 5.9626 1.4275 5.1006 10.2388 4.9904 2.2474 0.5433 0.1093 10.2271 0.4888 8.5563 58.3647 21.8850 44.1737 45.0107 23.8224 0.4868 16.8024 0.5024 6.6783 3.7996 0.8989 0.4311 49.3768 72.1744 5.2920 20.7726 1.5109 99.8475 7.6868 30.9611 11.3599 21.4039 0.2857 5.0181 95.9651 120.6445 0.3981 37.3891 19.7246 12.4690 50.2426 49.9872 45.3497 47.2793 4.3526 0.2555 23.3155 2.7295 0.1176 47.3581 2.7742 25.3134 0.2407 9.4120 0.8900 4.9192 18.0958 18.3953 1.8794 454.9321 11.7951 0.0261 27.3388 15.2424 48.5170 10.0368 24.2264 23.8535 42.2240 9.7013 31.0685 17.3854 14.3733 13.2460 22.3291 21.9818 24.3287 81.3602 6.2237 6.4734 7.4801 6.5406 20.1020 1.3641 17.1370 11.6927 26.5397 0.0309
temp: 298.150 k
press: 1.00000 atm
elementType: 17 17 8 8 7 7 6 6 6 6 6 6 6 6 6 6 6 6 6 6 6 6 6 6 1 1 1 1 1 1 1 1 1 1 1 1 1 1 1 1 1 1 1 1 1 1 1 1 1 1
symmnumber: 1
zpe: 1076984.0 jmol-1
zpe.correction: 0.410202 hartree
zpe.thermalcorrener: 0.437181 hartree
zpe.thermalcorrenthalpy: 0.438125 hartree
zpe.thermalcorrgfe: 0.347362 hartree
zpe.sumelectzpe: -1879.746374 hartree
zpe.sumelectthermal: -1879.719395 hartree
zpe.sumelectthermalent: -1879.718451 hartree
zpe.sumelectthermalfe: -1879.809214 hartree
dipole: -0.0246 0.7572 -0.0233
dipole: 0.7579
quadrupole: -240.8355 -156.3150 -150.1628
quadrupole: -0.2660 30.3089 0.0732
quadrupole: -58.3977 26.1228 32.2749 -0.2660 30.3089 0.0732
hfenergy: -1880.156576 hartree
pointgroup: C01 [X(C18H26Cl2N2O2)]
dipole: 0.0090147 -0.2978522 -0.0109684 debye
polarizability: 306.1492513|-0.4957102|198.3843982|17.2245771|0.0315363|199.9211893 unknown
InChI: InChI=1S/C18H26Cl2N2O2/c1-13(2)21(17(23)9-19)11-15-5-7-16(8-6-15)12-22(14(3)4)18(24)10-20/h5-8,13-14H,9-12H2,1-4H3
charge 0 multiplicity 1
50 atoms
Cl -5.953088 2.695537 -1.220783
Cl 5.925393 2.671043 1.260595
O  -5.771319 -0.17307 -0.403012
O  5.766198 -0.188889 0.403694
N  -3.716274 -0.15195 0.699205
N  3.711481 -0.164789 -0.699379
C  -3.692709 -1.651575 0.848728
C  3.690157 -1.663541 -0.857835
C  -2.621428 0.576327 1.374832
C  2.618782 0.566625 -1.374847
C  -1.271249 0.505859 0.655217
C  1.268142 0.50094 -0.655514
C  -1.189116 0.50361 -0.758567
C  0.065671 0.501228 -1.404116
C  -0.068981 0.484957 1.40357
C  1.185946 0.482475 0.758001
C  -3.726625 -2.383431 -0.511323
C  -4.807649 -2.130877 1.807491
C  3.726387 -2.403459 0.497766
C  4.805219 -2.135273 -1.820225
C  -4.788496 0.46918 0.065457
C  4.781693 0.454223 -0.060076
C  -4.70378 2.013858 -0.021903
C  4.692655 1.997811 0.039581
H  -2.711801 -1.864561 1.317479
H  2.709188 -1.875318 -1.32701
H  -2.508623 0.170297 2.39986
H  -2.906831 1.635314 1.507594
H  2.505048 0.16055 -2.399737
H  2.907576 1.624659 -1.508585
H  -2.108766 0.48401 -1.354564
H  0.108489 0.496711 -2.500682
H  -0.111903 0.46782 2.499994
H  2.10543 0.446563 1.353434
H  -4.68356 -2.207959 -1.026626
H  -2.900858 -2.04469 -1.161806
H  -3.607541 -3.469583 -0.343536
H  -5.799575 -1.934223 1.370013
H  -4.742191 -1.617209 2.784527
H  -4.708456 -3.217483 1.983679
H  4.68327 -2.22921 1.013565
H  2.900331 -2.070388 1.150818
H  3.609348 -3.488807 0.323497
H  5.797057 -1.939343 -1.382206
H  4.738189 -1.616022 -2.794203
H  4.707912 -3.221011 -2.002696
H  -3.722381 2.362919 -0.377936
H  -4.936936 2.479026 0.95021
H  3.70641 2.342569 0.386007
H  4.937968 2.471448 -0.925443
