program: Gaussian 09
title: 000229742
version: EM64L-G09RevD.01
frameworkgroup: C1[X(C23H26O9S)]
method: RPBEPBE
basis: SDD
operation: Freq
keyword: #p
keyword: freq=noraman
keyword: PBEPBE/SDD
title: #p freq=noraman PBEPBE/SDD
converged: YES YES NO NO
title: Mulliken charges:
elementType: S O O O O O O O O O C C C C C C C C C C C C C C C C C C C C C C C H H H H H H H H H H H H H H H H H H H H H H H H H H
charge: 0.957325 -0.265592 -0.304266 -0.247942 -0.475719 -0.402466 -0.290516 -0.536978 -0.484606 -0.254896 -0.139765 -0.192620 -0.023848 -0.099529 0.367534 -0.143557 -0.689643 -0.686791 -0.271473 -0.006611 0.226719 -0.232535 -0.240712 0.206579 -0.387737 -0.322963 0.454804 -0.341377 -0.333896 -0.795099 -0.221402 -0.220685 -0.223413 0.263631 0.260627 0.253766 0.259662 0.294965 0.216593 0.236672 0.224314 0.256279 0.215317 0.220179 0.266928 0.248354 0.389714 0.286015 0.282764 0.250550 0.249895 0.270591 0.264621 0.242571 0.231550 0.241700 0.233643 0.230775 0.232004
chargesum: 0.00000
title: Mulliken charges with hydrogens summed into heavy atoms:
elementType: S O O O O O O O O O C C C C C C C C C C C C C C C C C C C C C C C
charge: 0.957325 -0.265592 -0.304266 -0.247942 -0.086005 -0.402466 -0.290516 -0.536978 -0.484606 -0.254896 0.123866 0.068007 0.229918 0.160133 0.367534 0.151408 -0.012064 0.004985 0.243809 -0.006611 0.226719 0.053480 0.042051 0.206579 -0.137188 -0.073068 0.454804 -0.070786 -0.069274 -0.079279 0.012241 0.010090 0.008591
polarizability: 3.26889959e+02 -1.14116566e+01 3.11603383e+02 -9.22126644e+00 1.03051224e+01 2.86436769e+02
1716.lowfreq: -23.7187 -6.3658 -4.1409 -0.0003 0.0006 0.0008 4.1058 5.2496 10.8573
frequency: -23.6478 3.0771 10.5760 10.9995 22.9546 28.2133 33.5127 44.6242 50.3617 53.7160 56.8378 87.0402 94.7117 106.2686 116.7880 129.4788 134.8962 142.6862 170.3299 176.3518 185.0205 195.3674 220.0890 226.4261 233.0520 243.4000 268.3700 268.7691 297.4982 303.7032 312.6498 327.2468 347.2833 349.5273 357.4951 384.2485 388.3088 403.6040 407.0351 416.6568 434.9652 441.3368 445.7515 472.6653 488.5372 510.2205 535.6149 545.1982 592.8977 598.7147 614.0372 618.6819 620.0920 638.3673 668.9210 679.5722 701.6110 702.6847 720.9645 725.5968 749.8984 765.4271 777.4031 795.3103 803.9509 808.7933 819.0977 826.1796 832.0712 846.2876 847.2313 851.6794 864.9233 878.7646 900.8409 921.7229 940.9366 943.5547 948.5158 953.8529 964.7752 982.0768 984.2861 986.8142 990.1091 991.3336 995.5123 996.2780 997.1799 1008.6555 1018.7798 1021.9829 1034.5487 1048.2952 1050.4760 1053.2318 1066.4925 1076.1083 1088.7420 1122.4157 1138.7097 1153.7914 1173.7015 1181.2216 1187.5752 1190.7568 1207.7609 1213.7173 1219.3468 1239.3713 1242.2863 1246.4795 1250.9765 1262.4981 1272.6145 1288.6326 1300.0022 1301.1645 1314.8156 1318.8809 1336.5468 1345.1621 1360.7160 1378.1617 1382.1353 1389.5741 1391.1974 1394.4189 1402.3463 1403.8623 1437.8142 1447.0259 1448.8455 1453.9835 1467.2008 1468.6947 1472.7295 1475.0711 1475.7871 1478.3504 1584.6024 1592.4437 1595.6237 1611.6643 1621.8387 2985.7413 2998.6299 3002.7536 3009.4852 3026.0857 3030.6654 3042.7914 3065.2030 3066.2271 3097.1230 3097.7238 3098.0935 3106.9087 3109.9342 3113.6480 3116.8668 3129.2806 3141.6698 3142.1018 3146.2093 3154.5329 3166.5541 3167.6673 3172.0418 3176.6461 3299.5731
redmass: 1.0364 5.2205 5.6404 5.5332 4.8245 4.2596 4.7833 6.1835 4.2764 5.9411 5.6915 6.8573 7.1254 6.2285 5.8793 6.2522 6.2367 5.6778 6.0917 1.0599 4.9893 4.9795 3.0227 1.9640 3.0430 3.5340 6.3139 4.9989 5.2406 3.9010 3.5105 5.5846 4.7760 3.7999 4.5282 4.1948 4.4388 2.8219 2.8701 4.2406 5.5493 3.9457 4.9412 7.0813 3.7277 4.1685 5.6638 5.0451 5.2871 5.8850 6.4286 5.9681 6.9540 5.3864 6.3549 5.0388 1.6004 3.3280 3.5478 1.3373 4.4689 6.2133 4.9807 2.1703 5.6342 5.9793 6.1962 1.9441 2.4142 1.2542 4.9655 3.8809 1.2464 2.9369 4.0820 1.4767 6.8064 3.4918 3.6175 1.4265 1.2949 1.3494 1.5473 1.9075 4.7602 3.2730 1.4843 2.3508 3.3746 1.3298 2.7691 2.4187 4.5665 2.3205 1.5936 2.4412 2.7225 3.1110 1.9773 1.2884 1.9047 1.9345 1.0565 1.1349 1.1508 1.4373 1.3137 2.4747 3.1068 2.3299 2.6425 1.5464 1.4842 1.4657 1.2124 1.4878 1.2662 1.2822 1.3196 1.1468 1.2282 1.8957 1.4042 1.2852 4.0805 9.0941 1.2368 3.1337 1.3312 1.4300 2.2453 1.0762 1.0526 1.0495 1.0587 1.0459 2.2033 1.1465 1.0524 2.3003 6.8209 6.3114 6.4463 6.1739 10.2806 1.0377 1.0351 1.0355 1.0805 1.0746 1.0693 1.0869 1.0973 1.0884 1.0991 1.1075 1.1000 1.0995 1.1007 1.1005 1.0903 1.0855 1.0895 1.0891 1.0896 1.0938 1.0974 1.0962 1.0969 1.0984 1.0690
irintensity: 0.4908 0.5120 0.7324 0.1520 0.3524 0.3102 0.2224 1.2493 2.1541 0.4133 0.2326 1.1640 0.8617 2.6287 4.6524 0.1202 0.5409 0.9556 1.4262 0.0304 0.6517 1.8715 3.1001 18.7067 22.2223 7.6330 3.6681 16.0970 7.4734 1.2233 1.8260 1.0424 9.7821 7.6727 7.1680 7.8584 1.9212 0.0282 0.0211 7.5602 67.8660 2.1099 1.8699 25.9900 3.7338 60.1400 94.6301 7.7027 28.0580 66.4344 0.4990 80.5180 0.6261 9.6792 4.6546 11.4751 82.6628 1.6288 19.6709 209.5634 16.9522 8.4136 5.1339 23.8243 9.8998 82.2277 60.8803 55.2962 136.9424 0.2801 16.8737 22.1965 0.4429 33.8454 14.5262 1.6246 220.0699 25.3208 117.7086 7.0775 1.1533 3.2008 0.8470 1.0566 23.0758 81.0919 4.5156 1.2938 38.0487 0.5724 39.3115 44.2138 104.9871 102.2038 19.0114 33.7285 145.3210 7.5551 45.6901 7.6476 58.4716 9.3455 0.0955 46.5973 20.9693 14.4480 4.8743 105.6316 7.0500 136.4708 155.1828 96.6030 41.3828 7.6676 4.1694 6.2689 5.3297 23.3565 2.4607 2.0460 15.7450 1.5142 6.4619 44.6806 4.9102 1.9126 24.3564 12.2993 15.2117 24.1298 16.0690 18.2044 6.8842 3.6936 2.1463 14.7664 21.0281 17.6089 12.9363 6.1383 37.6240 14.6872 5.7853 11.3041 169.9579 17.8217 9.8245 16.4013 4.5331 2.2837 10.5238 29.8388 12.6972 19.6759 15.4707 8.0834 2.1394 28.5611 13.1252 34.8178 21.0305 0.3484 8.1464 10.8786 7.1773 15.1655 22.6106 1.4269 7.7371 8.6173 546.6280
temp: 298.150 k
press: 1.00000 atm
elementType: 16 8 8 8 8 8 8 8 8 8 6 6 6 6 6 6 6 6 6 6 6 6 6 6 6 6 6 6 6 6 6 6 6 1 1 1 1 1 1 1 1 1 1 1 1 1 1 1 1 1 1 1 1 1 1 1 1 1 1
symmnumber: 1
zpe: 1188516.2 jmol-1
zpe.correction: 0.452682 hartree
zpe.thermalcorrener: 0.484740 hartree
zpe.thermalcorrenthalpy: 0.485685 hartree
zpe.thermalcorrgfe: 0.382383 hartree
zpe.sumelectzpe: -1964.486629 hartree
zpe.sumelectthermal: -1964.454571 hartree
zpe.sumelectthermalent: -1964.453627 hartree
zpe.sumelectthermalfe: -1964.556928 hartree
dipole: -5.5703 3.8681 6.6236
dipole: 9.4796
quadrupole: -164.3657 -199.6758 -202.1173
quadrupole: -8.2224 -5.6672 3.2426
quadrupole: 24.3539 -10.9562 -13.3977 -8.2224 -5.6672 3.2426
hfenergy: -1964.9393111 hartree
pointgroup: C01 [X(C23H26O9S1)]
dipole: 2.4812137 0.6807689 -2.6999659 debye
polarizability: 330.48608|7.2793745|304.5153641|-10.492633|-12.3932529|289.9286666 unknown
InChI: InChI=1S/C23H26O9S/c1-14-9-11-16(12-10-14)33(26,27)32-17(13-28-21(25)15-7-5-4-6-8-15)19-18(24)20-22(29-19)31-23(2,3)30-20/h4-12,17-20,22,24H,13H2,1-3H3
charge 0 multiplicity 1
59 atoms
S  2.215042 -2.04992 1.408859
O  -2.707693 -1.053573 1.278664
O  -3.324472 -2.560338 -1.383324
O  -4.827687 -1.675129 0.225982
O  -0.976831 -3.606576 1.259682
O  0.962928 -0.89322 0.661964
O  -0.593601 1.517598 0.706301
O  1.783413 -3.57301 1.00732
O  2.410577 -1.666092 2.968022
O  -0.81332 3.362385 2.110208
C  -2.90812 -3.060652 -0.056608
C  -1.413037 -2.763673 0.155579
C  -1.442105 -1.25194 0.518584
C  -3.654926 -2.136516 0.937987
C  -4.546512 -1.70742 -1.237746
C  -0.311902 -0.776152 1.441782
C  -5.735053 -2.382618 -1.922118
C  -4.231969 -0.301733 -1.758357
C  -0.46816 0.662962 1.914662
C  3.680315 -1.539031 0.378593
C  -0.774578 2.882204 0.950079
C  3.931497 -2.242597 -0.808635
C  4.475371 -0.480253 0.849038
C  -0.910465 3.664064 -0.312905
C  5.056623 -1.851187 -1.567712
C  5.590804 -0.113465 0.069092
C  5.895446 -0.786215 -1.146577
C  -1.144601 5.059769 -0.207588
C  -0.815068 3.056345 -1.592067
C  7.101953 -0.373124 -1.967224
C  -1.284684 5.841709 -1.372224
C  -0.95496 3.843505 -2.754698
C  -1.190657 5.235125 -2.647867
H  -3.137291 -4.132092 0.058853
H  -0.83163 -2.944405 -0.766503
H  -1.460124 -0.644681 -0.405195
H  -4.007797 -2.576472 1.880382
H  -0.284605 -1.430878 2.335531
H  -5.566135 -2.434362 -3.011327
H  -5.865338 -3.405068 -1.531436
H  -6.657867 -1.808278 -1.730623
H  -3.443841 0.166653 -1.147102
H  -3.898632 -0.354659 -2.809462
H  -5.134878 0.330274 -1.702672
H  -1.383659 0.762601 2.5235
H  0.405294 0.988736 2.505174
H  0.009558 -3.779275 1.191901
H  3.28731 -3.071358 -1.117195
H  4.240531 0.02566 1.790578
H  5.282113 -2.381586 -2.499068
H  6.231884 0.70798 0.40823
H  -1.214842 5.505173 0.790345
H  -0.628685 1.980898 -1.660679
H  8.037492 -0.507541 -1.393015
H  7.186753 -0.964008 -2.894078
H  7.045587 0.694576 -2.248487
H  -1.467669 6.918386 -1.288758
H  -0.881287 3.375132 -3.742259
H  -1.300712 5.843061 -3.552989
