program: Gaussian 09
title: 000229703
version: EM64L-G09RevD.01
frameworkgroup: C1[X(C13H25BrO2)]
method: RPBEPBE
basis: SDD
operation: Freq
keyword: #p
keyword: freq=noraman
keyword: PBEPBE/SDD
title: #p freq=noraman PBEPBE/SDD
converged: YES YES NO NO
title: Mulliken charges:
elementType: Br O O C C C C C C C C C C C C C H H H H H H H H H H H H H H H H H H H H H H H H H
charge: 0.015708 -0.237228 -0.223867 -0.385260 -0.383419 -0.381494 -0.384845 -0.372935 -0.376158 -0.353148 -0.373378 -0.356623 -0.319141 -0.696516 0.349695 -0.771025 0.195564 0.193538 0.193076 0.195337 0.191572 0.192549 0.201901 0.196688 0.189377 0.190358 0.192398 0.200726 0.187796 0.187392 0.234091 0.216036 0.195208 0.194681 0.234979 0.226806 0.215264 0.209760 0.209463 0.302106 0.302966
chargesum: 0.00000
title: Mulliken charges with hydrogens summed into heavy atoms:
elementType: Br O O C C C C C C C C C C C C C
charge: 0.015708 -0.237228 -0.223867 0.003842 0.004994 0.002627 0.013744 0.006800 0.016966 0.022041 0.076750 0.033266 0.142645 -0.062029 0.349695 -0.165953
polarizability: 2.03705784e+02 2.88259376e+00 1.56316453e+02 1.25160142e+00 -2.77932591e+00 1.29312586e+02
1716.lowfreq: -5.8576 -4.2158 -0.0010 0.0003 0.0008 7.3532 13.6557 16.4360 32.1938
frequency: 12.4070 16.0453 32.1848 35.0819 41.9056 49.4708 62.6237 75.4839 92.6802 96.9686 114.1771 127.1235 147.9358 148.8549 150.6240 169.6540 197.9995 228.3120 269.8823 277.3071 303.8882 374.8424 390.4506 446.8383 476.1464 490.6858 530.4770 641.1801 720.0318 723.0651 724.5083 731.9732 748.8132 770.5841 785.5481 818.1014 868.1005 887.8476 898.1755 927.2438 948.5214 981.9617 983.7812 997.8084 1020.3824 1028.3102 1043.3330 1058.8796 1077.1843 1078.2874 1081.4301 1084.4875 1090.0085 1124.0632 1168.4410 1185.5013 1206.7338 1211.2375 1218.5572 1234.4272 1239.0468 1241.0669 1265.4694 1269.5649 1279.7370 1283.5084 1288.0149 1292.5683 1297.4995 1298.5959 1300.6507 1325.5469 1345.5268 1354.2240 1356.5970 1358.1523 1369.9955 1388.0216 1426.6782 1453.0204 1459.7806 1460.2032 1463.7483 1464.4638 1467.9098 1472.4590 1476.5968 1477.7414 1483.0288 1487.4327 1489.5570 1634.1982 2948.6251 2949.0881 2950.5859 2953.2431 2954.8427 2959.5516 2964.9723 2967.7437 2971.0996 2981.5985 2985.8434 2991.6762 2993.2462 2999.1592 3009.2481 3021.4713 3022.2179 3032.5690 3041.0951 3056.0425 3067.3228 3070.0664 3084.6969 3105.2372 3181.9148
redmass: 3.7179 6.3220 5.4422 2.6099 2.9218 2.8125 2.8314 2.1420 2.6619 3.0328 2.0124 2.0045 2.0733 4.7491 2.0601 4.9158 4.8055 1.1286 2.7492 3.4449 4.0378 3.1143 3.3523 3.6371 3.1346 3.6753 5.3719 4.6875 1.0605 1.1247 5.1223 1.0890 1.1169 1.4449 2.0619 1.2819 1.2571 1.9014 1.7766 1.2868 5.1450 4.4371 1.2466 4.2320 3.8820 1.0830 3.4270 3.0298 2.3949 2.3437 2.1367 1.7984 1.9993 2.9795 1.7832 1.7240 1.2774 1.4805 1.6128 1.5717 1.3202 1.3433 1.2698 1.2875 1.0192 1.1531 1.0831 1.1016 1.1528 1.1311 1.2193 1.3591 1.4438 1.6803 1.6049 1.6255 1.3735 1.2176 1.1174 1.0962 1.0748 1.0731 1.0679 1.0706 1.0776 1.0816 1.0436 1.0826 1.0898 1.0945 1.0968 9.5351 1.0586 1.0587 1.0592 1.0591 1.0591 1.0592 1.0589 1.0585 1.0365 1.0962 1.0974 1.0930 1.0659 1.1005 1.1034 1.1041 1.0588 1.1048 1.1045 1.1035 1.1007 1.0992 1.0556 1.1081 1.1125
irintensity: 0.1490 0.1161 0.7324 0.5800 0.2413 0.4914 0.5437 0.2687 0.1432 0.1063 0.1979 0.0141 0.0640 0.4477 0.0224 0.4026 1.3194 0.0017 13.2309 1.5015 2.4133 0.4877 4.0303 2.3941 1.4266 3.0522 22.2414 16.2491 16.7451 0.0131 0.4257 7.0180 0.8380 7.2005 1.4310 1.5039 1.1262 5.0825 2.1496 4.1965 72.6241 2.3217 0.6491 13.6230 0.9864 0.5457 3.8892 1.3897 0.8501 13.3643 2.7132 64.0864 69.1995 7.0771 1.3386 0.6425 27.0216 4.9895 123.5558 90.0648 1.1449 10.3838 1.9624 6.1910 0.2756 1.2917 0.1687 1.5540 0.4688 1.5424 0.5804 0.7855 1.2371 0.2532 0.0833 0.5120 0.9455 11.1832 19.8663 9.4274 0.0451 0.1761 0.1068 0.2620 0.6690 0.9958 11.8997 1.8751 2.2046 1.9033 40.9146 175.4403 0.0614 0.1655 0.5278 0.3546 5.7302 5.8617 56.5722 218.2769 36.8066 0.2427 0.1785 2.4943 17.5730 1.3874 0.2439 4.6914 43.4173 1.0905 205.2007 57.2964 98.4811 54.9208 7.2069 26.2419 0.4516
temp: 298.150 k
press: 1.00000 atm
elementType: 35 8 8 6 6 6 6 6 6 6 6 6 6 6 6 6 1 1 1 1 1 1 1 1 1 1 1 1 1 1 1 1 1 1 1 1 1 1 1 1 1
symmnumber: 1
zpe: 938843.2 jmol-1
zpe.correction: 0.357586 hartree
zpe.thermalcorrener: 0.378615 hartree
zpe.thermalcorrenthalpy: 0.379559 hartree
zpe.thermalcorrgfe: 0.301062 hartree
zpe.sumelectzpe: -672.972086 hartree
zpe.sumelectthermal: -672.951058 hartree
zpe.sumelectthermalent: -672.950114 hartree
zpe.sumelectthermalfe: -673.028611 hartree
dipole: -1.0222 -1.6726 -1.4853
dipole: 2.4594
quadrupole: -109.6124 -108.9204 -114.5476
quadrupole: -7.6166 -4.1005 2.1970
quadrupole: 1.4144 2.1064 -3.5209 -7.6166 -4.1005 2.1970
hfenergy: -673.3296729 hartree
pointgroup: C01 [X(C13H25Br1O2)]
dipole: -0.3116231 -0.5660734 -0.7201935 debye
polarizability: 202.037517|8.7694073|157.7925713|3.0728406|3.605969|129.5047346 unknown
InChI: InChI=1S/C13H25BrO2/c1-2-3-4-5-6-7-8-9-10-11-16-13(15)12-14/h2-12H2,1H3
charge 0 multiplicity 1
41 atoms
Br 6.163115 3.034097 0.517265
O  4.828795 -0.002492 -0.660749
O  5.009669 -0.254658 1.658516
C  -2.782381 0.352438 0.043821
C  -1.55192 -0.524046 -0.280481
C  -4.124651 -0.397506 -0.110191
C  -0.210893 0.231502 -0.146818
C  -5.356392 0.475655 0.218924
C  1.017256 -0.652611 -0.460069
C  -6.699073 -0.271737 0.055669
C  2.352321 0.121367 -0.352365
C  -7.931035 0.601527 0.385875
C  3.55069 -0.785895 -0.655545
C  -9.268086 -0.152464 0.21904
C  5.426398 0.213679 0.574566
C  6.665762 1.072694 0.414011
H  -2.69462 0.738047 1.081096
H  -2.782946 1.243256 -0.619025
H  -1.647649 -0.920959 -1.312993
H  -1.544639 -1.407319 0.39228
H  -4.213748 -0.779024 -1.149096
H  -4.123087 -1.291174 0.54886
H  -0.116894 0.63618 0.882029
H  -0.214758 1.108516 -0.827248
H  -5.355021 1.372529 -0.435863
H  -5.270994 0.852173 1.259908
H  0.912384 -1.07387 -1.481823
H  1.030228 -1.516442 0.236774
H  -6.702221 -1.169265 0.709554
H  -6.786532 -0.647149 -0.985642
H  2.459636 0.54064 0.665794
H  2.351656 0.970983 -1.062139
H  -7.843257 0.976086 1.426319
H  -7.926987 1.498145 -0.267525
H  3.640599 -1.596693 0.090229
H  3.503279 -1.204749 -1.673996
H  -10.132148 0.495449 0.455971
H  -9.312793 -1.033263 0.88741
H  -9.391635 -0.514456 -0.8193
H  7.135941 0.941014 -0.569239
H  7.361729 0.905793 1.245896
