program: Gaussian 09
title: 000229700
version: EM64L-G09RevD.01
frameworkgroup: C1[X(C11H22O2)]
method: RPBEPBE
basis: SDD
operation: Freq
keyword: #pfreq=noraman
keyword: PBEPBE/SDD
title: #p freq=noraman PBEPBE/SDD
converged: YES YES NO NO
title: Mulliken charges:
elementType: O O C C C C C C C C C C C H H H H H H H H H H H H H H H H H H H H H H
charge: -0.275452 -0.255945 0.321508 -0.377138 -0.361496 -0.744937 -0.723135 -0.404400 -0.696976 -0.183639 0.275361 -0.686875 -0.689971 0.194580 0.187341 0.211593 0.247008 0.223203 0.208650 0.218222 0.208880 0.235041 0.203540 0.242261 0.202879 0.209712 0.204661 0.218566 0.238835 0.221162 0.232929 0.219644 0.215203 0.221764 0.237420
chargesum: 0.00000
title: Mulliken charges with hydrogens summed into heavy atoms:
elementType: O O C C C C C C C C C C C
charge: -0.275452 -0.255945 0.321508 0.004783 0.097104 -0.094861 -0.075673 0.040740 -0.064037 0.055196 0.275361 -0.013140 -0.015583
polarizability: 1.43165344e+02 -6.92762697e+00 1.23087824e+02 -1.65830200e+00 -1.57003637e+00 1.10852167e+02
1716.lowfreq: -13.3005 -6.1135 0.0007 0.0008 0.0010 11.5307 19.9754 26.7144 42.3952
frequency: 18.8415 25.3976 42.2148 70.1546 85.7558 106.6174 169.3590 194.8014 197.3361 205.1894 209.7285 233.5713 235.9170 244.9205 252.4028 276.6777 293.0052 316.4443 336.3466 361.9106 399.3312 449.7399 479.0915 540.5379 627.7784 710.0143 739.3709 751.9678 793.6413 858.1614 866.4680 880.6916 915.3055 928.3841 929.5665 935.5450 953.9599 963.0867 981.3917 1004.5605 1051.5432 1078.6055 1094.0990 1099.2808 1102.8908 1109.4887 1175.3122 1183.7800 1199.7220 1223.6693 1262.7101 1279.7116 1303.2273 1305.7001 1310.1625 1330.9894 1352.4790 1356.2619 1374.9478 1376.2468 1387.2068 1393.4046 1395.1341 1455.4024 1461.3984 1464.6037 1470.4792 1471.2246 1473.0539 1476.0258 1477.2314 1478.0325 1480.2401 1486.8709 1489.8539 1493.6647 1636.5108 2958.1231 2968.5520 2971.3060 2974.6061 2981.9929 2982.2710 2986.8915 3005.1061 3011.9386 3036.4195 3036.7197 3061.9106 3065.5860 3068.6143 3071.2659 3075.1306 3079.7979 3083.4436 3083.9304 3084.4705 3087.9044 3097.3965
redmass: 2.7162 4.6257 3.4842 2.9124 2.0313 2.8475 2.6445 1.9456 1.1889 1.1975 1.6942 1.3514 1.3314 1.3718 1.5925 3.6121 3.0186 2.4392 2.3950 2.4425 2.6124 2.4830 2.3746 3.7826 3.3486 6.6134 1.1368 3.2591 3.3352 1.3846 3.2930 2.0409 1.8584 1.1932 1.7262 1.8693 2.2431 1.4463 1.5439 1.3144 2.6326 1.4874 2.5688 1.7855 2.4100 2.5557 1.8635 2.0658 2.0429 1.9524 1.3536 1.7101 1.4280 1.3243 1.1995 1.4594 1.5315 1.5063 1.1987 1.2035 1.2112 1.2062 1.2128 1.0655 1.0773 1.0484 1.0480 1.0575 1.0579 1.0491 1.0486 1.0456 1.0560 1.0857 1.0590 1.0648 8.5778 1.0584 1.0360 1.0357 1.0366 1.0383 1.0563 1.0351 1.0954 1.0595 1.0856 1.1012 1.0995 1.1004 1.1002 1.0991 1.0997 1.1006 1.1025 1.1034 1.0998 1.1011 1.0996
irintensity: 0.0744 1.9298 0.3440 1.1392 0.2335 0.5066 0.1015 1.6462 0.1934 0.1146 0.2112 1.2373 0.1569 1.5296 0.2753 5.7691 7.9895 0.2552 3.0305 4.2443 3.2271 0.7446 0.7995 1.4657 1.2671 4.3691 11.8896 5.0044 9.7962 0.8989 8.4332 2.3332 9.9186 5.5428 3.6994 15.6143 21.8440 0.5149 10.5535 0.2684 0.5393 14.0647 246.5234 61.9450 70.9597 22.4774 3.4111 7.9024 0.3413 3.3051 3.8668 4.3115 7.4768 1.5882 2.9374 9.5644 25.2690 2.4353 18.3955 19.1013 9.5245 41.4150 5.9286 2.4920 4.4267 4.8452 1.3173 3.2290 8.4210 5.4305 23.6786 5.2605 9.0810 4.2782 31.2803 33.9678 134.7230 19.9843 45.5822 23.9081 32.3786 13.9071 48.3772 28.6840 15.4397 43.8030 4.7285 5.5901 5.7068 40.5877 115.2901 36.8233 34.8455 26.3474 34.5796 40.5976 33.2557 7.3851 45.3874
temp: 298.150 k
press: 1.00000 atm
elementType: 8 8 6 6 6 6 6 6 6 6 6 6 6 1 1 1 1 1 1 1 1 1 1 1 1 1 1 1 1 1 1 1 1 1 1
symmnumber: 1
zpe: 812980.5 jmol-1
zpe.correction: 0.309648 hartree
zpe.thermalcorrener: 0.326738 hartree
zpe.thermalcorrenthalpy: 0.327682 hartree
zpe.thermalcorrgfe: 0.263852 hartree
zpe.sumelectzpe: -581.746716 hartree
zpe.sumelectthermal: -581.729626 hartree
zpe.sumelectthermalent: -581.728682 hartree
zpe.sumelectthermalfe: -581.792512 hartree
dipole: 0.5693 -0.7388 1.4537
dipole: 1.7272
quadrupole: -76.3646 -82.5927 -86.2333
quadrupole: -0.1910 -4.5233 2.7582
quadrupole: 5.3656 -0.8625 -4.5031 -0.1910 -4.5233 2.7582
hfenergy: -582.0563638 hartree
pointgroup: C01 [X(C11H22O2)]
dipole: -0.1744275 -0.2244815 -0.6172055 debye
polarizability: 139.2507596|10.8279109|126.042635|-0.879946|3.6110425|111.8119404 unknown
InChI: InChI=1S/C11H22O2/c1-6-7-11(4,5)8-13-10(12)9(2)3/h9H,6-8H2,1-5H3
charge 0 multiplicity 1
35 atoms
O  0.685878 -0.983671 -0.265357
O  1.312999 0.325404 1.570321
C  -1.810439 -1.127141 -0.33487
C  -1.958142 0.416692 -0.511806
C  -0.525589 -1.484676 0.452717
C  -3.005282 -1.716421 0.463471
C  -1.756333 -1.786404 -1.739111
C  -2.062923 1.267723 0.7763
C  -2.148261 2.777127 0.457257
C  2.644279 0.402354 -0.512737
C  1.510716 -0.06628 0.395906
C  2.343069 1.856989 -0.969824
C  3.995824 0.319814 0.235977
H  -1.097253 0.780326 -1.110565
H  -2.860508 0.598727 -1.132303
H  -0.39923 -2.581121 0.504175
H  -0.528704 -1.060853 1.472237
H  -3.053818 -1.318399 1.493256
H  -2.934276 -2.81896 0.528166
H  -3.958091 -1.469772 -0.040532
H  -2.671567 -1.551736 -2.314019
H  -0.883694 -1.422821 -2.309925
H  -1.677725 -2.88758 -1.659814
H  -1.185443 1.08714 1.425857
H  -2.959207 0.970139 1.355496
H  -1.240966 3.119211 -0.076553
H  -3.020811 3.001637 -0.185796
H  -2.242231 3.379236 1.379475
H  2.660273 -0.257744 -1.398011
H  3.14757 2.214463 -1.6372
H  2.288397 2.530542 -0.095938
H  1.386169 1.918688 -1.519447
H  4.807724 0.708906 -0.404468
H  4.243454 -0.720908 0.511977
H  3.958243 0.920067 1.161889
