program: Gaussian 09
title: 000229693
version: EM64L-G09RevD.01
frameworkgroup: C1[X(C8H14Br2O2)]
method: RPBEPBE
basis: SDD
operation: Freq
keyword: #p
keyword: freq=noraman
keyword: PBEPBE/SDD
title: #p freq=noraman PBEPBE/SDD
converged: YES YES NO NO
title: Mulliken charges:
elementType: Br Br O O C C C C C C C C H H H H H H H H H H H H H H
charge: -0.001394 0.020955 -0.305166 -0.245778 0.364116 -0.460952 -0.714217 -0.714755 -0.691842 0.298253 -0.488125 -0.658541 0.371597 0.236204 0.234120 0.234185 0.268513 0.246775 0.224934 0.309391 0.302109 0.242483 0.242993 0.238842 0.218355 0.226945
chargesum: 0.00000
title: Mulliken charges with hydrogens summed into heavy atoms:
elementType: Br Br O O C C C C C C C C
charge: -0.001394 0.020955 -0.305166 -0.245778 0.364116 -0.089355 -0.009708 0.025467 -0.080342 0.298253 -0.002649 0.025601
polarizability: 1.46130014e+02 -7.55165885e+00 1.28888029e+02 -7.73961346e+00 -5.67175580e+00 9.90851403e+01
1716.lowfreq: -12.1462 -9.0813 -2.1316 0.0005 0.0005 0.0007 25.2594 38.1977 44.9332
frequency: 25.2084 38.0914 44.8804 72.3898 87.4926 132.0944 138.3919 162.6418 195.0764 202.9413 211.5781 218.4595 245.2906 268.2247 294.0111 313.6271 344.0042 410.2258 454.8547 494.5018 544.7263 603.0110 642.7263 659.8109 729.4923 792.1210 803.0137 848.7541 883.7663 938.1645 954.6266 1000.0034 1013.1992 1063.1428 1065.6128 1083.3019 1098.5914 1122.5526 1148.4434 1170.5104 1227.3687 1232.0512 1242.5627 1270.2340 1332.9182 1334.5518 1381.7885 1397.2013 1398.5191 1428.8276 1444.4187 1455.7882 1467.9652 1472.1857 1475.1270 1483.6996 1489.3288 1640.7921 2990.8720 2999.9606 3002.2849 3004.5739 3053.2855 3053.6141 3096.1639 3098.9138 3102.9334 3103.8778 3106.8134 3109.9324 3124.4495 3142.6427
redmass: 3.7099 5.4987 3.8620 3.2353 10.2701 6.2405 3.3614 2.4358 1.1920 1.4478 3.7898 1.7193 1.6127 2.4869 3.2912 4.1819 3.4546 3.0093 3.3385 3.2551 2.8915 3.4358 4.8674 3.8512 5.2769 1.4483 2.9583 4.2329 1.5586 1.4984 2.1837 1.3744 1.9358 2.3746 2.6120 1.7786 1.9102 1.3317 1.9127 1.9736 1.1873 2.5183 1.1857 1.6332 1.5497 1.5800 1.2199 1.2109 1.2044 1.0910 1.0857 1.0516 1.0506 1.0403 1.0574 1.0509 1.0515 9.1992 1.0642 1.0366 1.0358 1.0366 1.0719 1.0795 1.1006 1.0988 1.0994 1.0879 1.1002 1.0997 1.1004 1.1075
irintensity: 0.0462 0.8149 0.3764 2.2935 0.6219 0.8463 0.5297 2.5066 0.2382 0.8807 0.4350 6.0059 0.9245 1.7151 9.2482 8.3243 6.0830 4.4341 1.5604 11.3798 6.2724 16.4379 19.1833 7.8558 24.7283 16.4665 1.0237 28.0329 33.1484 1.6219 14.5371 4.8880 62.4602 13.6114 209.9043 0.0339 161.5141 28.4977 43.4955 3.7108 16.3166 39.2899 1.7894 20.7205 45.2621 18.6098 37.3508 19.6461 25.4632 11.3469 32.2754 6.1700 7.2810 14.5188 4.8035 13.1850 23.7906 129.1363 14.0415 24.8598 9.9697 12.9548 8.3171 3.2645 31.1827 7.4279 26.8475 4.8547 25.8386 19.3394 7.1394 0.9884
temp: 298.150 k
press: 1.00000 atm
elementType: 35 35 8 8 6 6 6 6 6 6 6 6 1 1 1 1 1 1 1 1 1 1 1 1 1 1
symmnumber: 1
zpe: 542418.0 jmol-1
zpe.correction: 0.206596 hartree
zpe.thermalcorrener: 0.222154 hartree
zpe.thermalcorrenthalpy: 0.223098 hartree
zpe.thermalcorrgfe: 0.160884 hartree
zpe.sumelectzpe: -489.660253 hartree
zpe.sumelectthermal: -489.644695 hartree
zpe.sumelectthermalent: -489.643751 hartree
zpe.sumelectthermalfe: -489.705964 hartree
dipole: -3.1387 -1.8882 2.8336
dipole: 4.6310
quadrupole: -87.8666 -90.9000 -94.1797
quadrupole: -1.3718 -2.0985 -0.3539
quadrupole: 3.1155 0.0821 -3.1976 -1.3718 -2.0985 -0.3539
hfenergy: -489.8668488 hartree
pointgroup: C01 [X(C8H14Br2O2)]
dipole: -0.9797408 0.9663752 -1.1940769 debye
dipolederiv: -0.5245628 -0.1397928 -0.1863636 -0.0965207 -0.180787 -0.0813848 -0.1637243 -0.0779218 -0.194631 -0.1255048 0.0995204 0.011065 0.1478792 -0.4814603 0.0143062 -0.0173118 0.1067035 -0.1137605 -1.5617243 -0.425418 0.1844558 -0.386533 -0.604614 0.179023 0.3618159 0.1665988 -0.568023 -0.7143014 -0.0763831 -0.1416535 -0.1488032 -0.3745397 0.0910837 0.2274804 0.1899934 -0.8147061 0.8381704 0.080154 -0.1101065 -0.0341169 0.4998861 -0.1125597 0.1368068 -0.0632149 0.3039206 0.6045123 0.2695068 0.3426788 0.2103107 -0.0304348 0.1828476 0.3011248 0.2706359 0.089182 -0.1039092 -0.0051128 0.0197942 -0.0238241 -0.0206728 0.0547253 0.0342816 0.0748605 -0.1077175 -0.1319035 0.0605712 0.0547757 -0.007078 -0.1577292 -0.0759429 -0.0295581 -0.0202916 -0.1014616 -0.0175738 -0.2468585 -0.0744386 -0.1583477 0.650913 -0.1569001 -0.0162978 -0.2622336 0.0489926 1.6129993 0.393559 0.0637479 0.5720914 0.4014809 -0.2287371 -0.5561866 -0.390373 1.0490182 -0.2332744 -0.0836364 -0.1155914 -0.019293 0.0952736 0.0575605 -0.1432368 0.0195848 -0.0470979 0.0193293 -0.0431151 0.0348969 -0.0247315 0.0367914 0.0221428 -0.0351085 0.0127093 0.0231517 0.0502299 -0.0717069 -0.0047258 -0.030117 0.049652 0.0072275 -0.0594814 -0.0152055 0.0202903 -0.0716858 -0.0812412 -0.0068346 -0.0678191 0.0946951 -0.0145683 -0.0367038 -0.0337764 0.0871267 0.0380259 0.1248892 -0.0508357 0.1038414 -0.0531249 0.0682687 -0.0200771 0.0394816 0.0726972 0.1021971 0.0039424 0.0137452 0.0038967 -0.0093882 -0.1300649 0.0400975 -0.114579 -0.027006 0.1049003 -0.000152 0.0618704 -0.0212365 0.0892048 0.0785054 0.0561461 0.0391627 -0.0229139 -0.0441866 -0.1130009 -0.0323496 -0.0975002 0.0602233 -0.0232409 -0.0253002 -0.0273574 0.1124757 -0.0030618 0.1322621 -0.04245 0.1182283 -0.0134107 0.025008 -0.0600965 0.0461302 0.0477356 0.0408728 0.0308118 0.0598335 -0.0265905 -0.0427805 0.0936603 0.0417744 0.0667519 0.0215449 0.0160282 0.0016447 -0.0770537 -0.0215285 -0.0280112 0.027068 -0.1088952 0.013147 0.0332022 0.0309528 0.0286724 -0.0253532 0.0250875 -0.0917025 0.0292434 0.0037484 0.0146324 0.1074105 0.0530524 -0.0020778 0.0840904 -0.0423398 0.0744715 -0.0607107 0.0751464 -0.027124 -0.0628561 0.1165709 0.0055377 0.0269502 0.0150333 0.0593798 -0.0711136 0.0886962 -0.0419623 -0.0837299 -0.1456728 -0.0553564 -0.0970535 -0.0459488 0.0824132 0.0053622 -0.1218353 -0.0078098 0.0364068 0.0495197 0.1127801 0.0069056 0.0559599 -0.1057291 0.0191903 0.0266949 0.0214574 0.0907487 unknown
polarizability: 145.0836893|5.1995307|127.9453915|13.3780918|-4.1758095|101.0741025 unknown
InChI: InChI=1S/C8H14Br2O2/c1-4-7(11)12-8(2,3)6(10)5-9/h6H,4-5H2,1-3H3
charge 0 multiplicity 1
26 atoms
Br 3.204906 0.464371 1.097468
Br 2.143837 -2.988029 0.128551
O  -0.725279 0.563579 -0.72155
O  -1.468729 -0.247316 1.354532
C  0.610989 1.10313 -0.195387
C  1.395958 -0.136473 0.354199
C  1.232801 1.720805 -1.457225
C  0.3376 2.166971 0.883876
C  1.622592 -1.220356 -0.697604
C  -1.673398 -0.008414 0.143454
C  -2.963835 -0.276426 -0.617495
C  -3.88837 -1.26981 0.110551
H  0.878621 -0.529235 1.241946
H  2.254908 2.074639 -1.241553
H  0.622965 2.578467 -1.786675
H  1.272798 0.994341 -2.286246
H  -0.041467 1.718651 1.814944
H  1.266292 2.717109 1.107883
H  -0.406944 2.88739 0.501054
H  2.432333 -0.977695 -1.399742
H  0.685881 -1.42617 -1.239943
H  -3.471587 0.700379 -0.750202
H  -2.707258 -0.620805 -1.635549
H  -4.103213 -0.92616 1.136186
H  -4.842691 -1.373999 -0.434565
H  -3.421507 -2.267245 0.18579
