program: Gaussian 09
title: 000021711
version: EM64L-G09RevD.01
frameworkgroup: C1[X(C12H13NO2)]
method: RPBEPBE
basis: SDD
operation: Freq
keyword: #p
keyword: freq=noraman
keyword: PBEPBE/SDD
title: #p freq=noraman PBEPBE/SDD
converged: YES YES NO NO
title: Mulliken charges:
elementType: O O N C C C C C C C C C C C C H H H H H H H H H H H H H
charge: -0.265052 -0.239832 -0.407931 0.394236 0.120165 -0.548208 0.227650 -0.441341 -0.507286 -0.408729 -0.352846 -0.258867 -0.217611 0.245062 -0.506801 0.233329 0.226513 0.268885 0.263300 0.259541 0.303963 0.230898 0.226147 0.219862 0.220873 0.240773 0.233056 0.240249
chargesum: 0.00000
title: Mulliken charges with hydrogens summed into heavy atoms:
elementType: O O N C C C C C C C C C C C C
charge: -0.265052 -0.239832 -0.103968 0.394236 0.120165 -0.088367 0.227650 -0.172456 0.015556 -0.177831 -0.126699 -0.039005 0.003263 0.245062 0.207278
polarizability: 1.80150178e+02 -9.55537412e+00 1.52600075e+02 -1.24001136e+01 -5.13292801e+00 8.74219781e+01
1716.lowfreq: -17.6787 -5.6584 -3.7811 -0.0005 0.0002 0.0006 4.6542 30.3077 56.4145
frequency: -16.7262 30.3070 56.4140 69.7310 94.4808 145.3539 161.5876 190.2824 219.2977 232.6257 273.7030 338.4975 422.7249 433.2599 461.9107 503.1695 533.3724 548.4675 569.1391 576.6237 623.2961 658.3703 728.9678 745.3352 748.1007 768.0602 779.1197 801.0641 848.5498 853.6347 868.5761 930.5747 947.4203 969.9944 995.1108 1011.2570 1051.1964 1070.5457 1094.0995 1112.6230 1129.5106 1129.8367 1147.4022 1151.0210 1169.8372 1235.7595 1244.8369 1273.2759 1277.5535 1299.9368 1350.2331 1356.0185 1391.0005 1420.9900 1421.9391 1440.7195 1453.1692 1459.2577 1463.7546 1469.8391 1482.0709 1565.4839 1587.1085 1631.6040 1645.9828 2996.0828 3003.0408 3005.4773 3041.9178 3067.0010 3104.6822 3121.4559 3128.6406 3143.0034 3147.4763 3161.4144 3219.1560 3613.9196
redmass: 6.3872 4.1565 4.3353 2.3680 1.0905 4.6111 2.8014 4.2506 3.9875 3.3238 4.8089 5.6786 2.9440 4.0942 3.6205 1.2244 5.7790 2.5672 5.5785 2.9996 3.3595 4.6713 4.1975 3.1144 1.3418 3.8468 1.6816 1.5579 1.8699 2.9562 5.1891 1.3841 6.1110 1.2986 2.0281 2.1620 4.8005 3.3476 1.5895 1.2659 1.6579 2.2840 1.4364 1.2987 1.1096 2.0583 1.5168 1.3138 1.5618 1.9720 1.7751 1.6656 5.2890 2.2878 1.2046 1.0877 1.0503 4.1407 1.0510 1.0940 3.0444 6.3345 6.2085 6.8651 8.9949 1.0618 1.0329 1.0573 1.0983 1.1013 1.1045 1.0848 1.0889 1.0951 1.1047 1.1001 1.0984 1.0809
irintensity: 1.2152 0.2607 1.4020 0.2472 0.2366 1.4911 6.6413 4.3451 9.2530 1.5546 18.7469 5.4577 10.5980 2.8612 2.8184 101.1289 3.3978 2.2937 10.4491 8.8470 0.7308 2.9107 5.2808 9.6718 110.7595 4.6833 2.1612 28.7758 2.3905 5.3003 2.1354 2.4604 16.9598 0.0543 4.2779 13.4640 30.1534 3.5872 43.1700 0.0803 104.2510 165.0764 4.8460 6.2961 1.7172 3.4088 13.1758 0.4490 71.3281 33.3731 18.9612 24.0249 38.7022 6.7317 20.9732 19.9843 13.6121 21.6495 11.1947 19.3068 1.9404 2.5773 0.0984 2.4752 170.9247 14.4980 36.0842 17.0050 1.4949 20.5338 28.0218 3.0944 4.2868 40.3098 16.9187 28.3880 1.2802 60.0667
temp: 298.150 k
press: 1.00000 atm
elementType: 8 8 7 6 6 6 6 6 6 6 6 6 6 6 6 1 1 1 1 1 1 1 1 1 1 1 1 1
symmnumber: 1
zpe: 588671.9 jmol-1
zpe.correction: 0.224213 hartree
zpe.thermalcorrener: 0.237371 hartree
zpe.thermalcorrenthalpy: 0.238316 hartree
zpe.thermalcorrgfe: 0.183144 hartree
zpe.sumelectzpe: -669.199525 hartree
zpe.sumelectthermal: -669.186367 hartree
zpe.sumelectthermalent: -669.185423 hartree
zpe.sumelectthermalfe: -669.240594 hartree
dipole: 0.7566 1.3200 -2.0549
dipole: 2.5568
quadrupole: -71.6120 -75.6722 -95.7969
quadrupole: 10.1501 2.0900 -4.9892
quadrupole: 9.4150 5.3549 -14.7699 10.1501 2.0900 -4.9892
hfenergy: -669.4237386 hartree
pointgroup: C01 [X(C12H13N1O2)]
dipole: -0.2692989 0.6255447 0.7403209 debye
polarizability: 180.6488142|6.8214808|152.2670957|-13.9485241|-2.3649208|87.2563213 unknown
InChI: InChI=1S/C12H13NO2/c1-15-12(14)7-6-9-8-13-11-5-3-2-4-10(9)11/h2-5,8,13H,6-7H2,1H3
charge 0 multiplicity 1
28 atoms
O  4.050697 -0.60208 0.980776
O  3.796048 0.02045 -1.249175
N  -2.347985 2.040746 0.214247
C  -0.404536 1.005926 -0.419204
C  -1.423934 -0.008103 -0.192229
C  1.027404 0.767871 -0.8309
C  -2.63171 0.670244 0.204389
C  -1.009397 2.236536 -0.16393
C  1.878454 0.172503 0.319131
C  -1.43762 -1.425264 -0.298781
C  -3.827876 -0.021224 0.498601
C  -2.627111 -2.120972 -0.008153
C  -3.809003 -1.426607 0.388621
C  3.306629 -0.124456 -0.105732
C  5.467014 -0.936053 0.690558
H  1.073961 0.080688 -1.697001
H  1.4926 1.711496 -1.169148
H  -0.585363 3.237467 -0.227362
H  1.426881 -0.763171 0.700248
H  1.904137 0.860946 1.184457
H  -3.010137 2.778901 0.44078
H  -0.539962 -1.971511 -0.611301
H  -4.739935 0.506969 0.799033
H  -2.651939 -3.213478 -0.088198
H  -4.718834 -1.99629 0.608752
H  5.524748 -1.719522 -0.083729
H  5.872448 -1.293245 1.64755
H  6.006722 -0.040665 0.338798
