program: Gaussian 09
title: 000229677
version: EM64L-G09RevD.01
frameworkgroup: C1[X(C16H32O2)]
method: RPBEPBE
basis: SDD
operation: Freq
keyword: #pfreq=noraman
keyword: PBEPBE/SDD
title: #p freq=noraman PBEPBE/SDD
converged: YES YES NO NO
title: Mulliken charges:
elementType: O O C C C C C C C C C C C C C C C C H H H H H H H H H H H H H H H H H H H H H H H H H H H H H H H H
charge: -0.285734 -0.237468 0.322866 -0.025169 -0.112521 -0.398271 0.020278 -0.759767 -0.738043 -0.438023 -0.729056 -0.714666 -0.381429 -0.382154 -0.384357 -0.355375 -0.347651 -0.697096 0.181654 0.227633 0.231285 0.186837 0.194265 0.234153 0.211967 0.214811 0.201326 0.255289 0.212681 0.200582 0.200949 0.256334 0.209543 0.195359 0.210546 0.216240 0.208532 0.212641 0.225884 0.183198 0.191986 0.189449 0.190272 0.202793 0.181902 0.193832 0.190034 0.208828 0.213541 0.209294
chargesum: 0.00000
title: Mulliken charges with hydrogens summed into heavy atoms:
elementType: O O C C C C C C C C C C C C C C C C
charge: -0.285734 -0.237468 0.322866 0.156484 0.115112 0.019851 0.214542 -0.098836 -0.068747 -0.036493 -0.067820 -0.079348 0.057096 -0.006970 -0.004637 0.029320 0.036214 -0.065433
polarizability: 1.97396236e+02 2.52347455e+00 1.75928612e+02 5.12412747e+00 -2.91648669e-01 1.62482789e+02
1716.lowfreq: -10.8950 -6.3237 -0.4834 -0.0008 -0.0006 -0.0006 16.5572 24.3689 42.4070
frequency: 13.0973 24.2190 42.3174 60.7222 66.9849 74.2599 96.1791 101.7117 126.3149 152.0525 168.1989 191.0514 201.9997 214.6936 222.7462 227.2875 229.9062 236.5478 248.3829 261.4976 284.1113 307.5921 310.5456 324.6279 355.3768 363.7097 389.7494 413.1492 443.6769 466.2233 487.5558 503.4091 527.8008 626.2301 686.7782 720.7792 735.4457 767.8936 769.1782 791.4299 839.5365 852.1706 866.1596 891.5252 898.6407 910.0662 914.3787 922.5453 928.3405 938.2170 950.2775 957.6788 970.4625 984.8151 997.8734 1009.3936 1023.5768 1041.0540 1047.3170 1072.8928 1094.1955 1110.4633 1118.8505 1124.9291 1136.0361 1144.4425 1175.5678 1180.2727 1182.0679 1208.0393 1212.0530 1215.8829 1250.0351 1258.3009 1267.7654 1270.8278 1280.1155 1284.8473 1289.8079 1295.3780 1308.7016 1311.1351 1333.4600 1336.8764 1340.5561 1343.8282 1355.8320 1359.1482 1360.9437 1368.3756 1374.3180 1379.5531 1386.8646 1394.2053 1400.7796 1447.4263 1447.9506 1461.4537 1461.7045 1464.7539 1466.4417 1466.9730 1468.2021 1475.9226 1477.1891 1477.6742 1480.8900 1483.7996 1487.6238 1488.2578 1492.9549 1505.3812 2865.0847 2883.5858 2913.7154 2946.8881 2954.0945 2957.0640 2966.4614 2970.5165 2971.7098 2971.8404 2978.6423 2980.2135 2989.1910 2993.3797 2993.6266 2998.5619 2999.4974 3009.6421 3036.2482 3038.1415 3050.6975 3060.3518 3061.5990 3067.2584 3068.2741 3068.8166 3069.3046 3069.6614 3083.6513 3094.0882 3104.6687 3108.9461
redmass: 3.1854 3.6649 2.4585 1.9178 2.7249 3.2066 2.4352 2.2431 2.6783 2.8722 1.9761 1.5408 1.6572 1.1126 2.6682 3.0117 1.2011 1.1802 1.4897 2.4662 2.6109 2.8145 2.3000 1.9862 2.6428 2.2436 2.6080 2.3495 2.3663 3.2062 3.2970 3.1042 3.4861 6.5640 4.0060 1.1295 1.1481 1.7377 2.1345 1.5908 2.4071 1.9687 2.4582 1.8938 1.5902 1.9663 1.9874 1.5529 2.4457 1.3975 2.1788 1.7355 1.7864 1.6681 1.4563 2.8755 1.6125 2.5613 2.7578 2.3884 2.2623 1.9557 2.1722 2.2725 1.8829 2.2445 2.3205 1.7219 1.7411 1.7742 2.1347 1.4352 1.3644 1.3118 1.2703 1.5208 1.2241 1.0816 1.1680 1.0964 1.4523 1.3950 1.4413 1.2059 1.4108 1.4958 1.6116 1.2817 1.6987 1.4271 1.2325 1.2197 1.2178 1.2200 1.2011 1.0878 1.0845 1.0721 1.0512 1.0748 1.0728 1.0545 1.0537 1.0497 1.0446 1.0718 1.0517 1.0903 1.0686 1.0685 1.0550 1.0505 1.0823 1.0815 1.0683 1.0587 1.0616 1.0601 1.0605 1.0362 1.0390 1.0387 1.0375 1.0366 1.0609 1.0822 1.0945 1.0702 1.0890 1.1010 1.1034 1.0999 1.0984 1.0983 1.0960 1.1007 1.0982 1.1010 1.1008 1.0989 1.0990 1.0989 1.0979 1.0945
irintensity: 0.0721 0.1144 0.1824 0.0403 0.0956 0.2237 0.3079 0.2332 1.0741 0.5155 0.1953 0.0902 1.1186 0.0419 2.2046 0.8608 0.3279 0.1186 0.7095 1.8169 0.5828 1.9059 2.8175 0.9567 2.0736 2.0831 0.2959 0.3374 1.1979 2.3491 0.7315 0.1185 1.9868 6.9864 5.6662 8.7028 3.0307 7.7345 0.9733 23.3150 0.8909 16.3708 8.0943 10.1079 6.2827 15.1088 16.0885 10.6551 40.9266 5.3264 9.4466 20.0546 7.8489 22.4037 2.2135 32.0507 2.9659 60.4836 70.3211 1.9915 12.9075 31.0094 0.4056 15.9922 24.9904 8.4034 4.8813 6.6405 1.7359 3.7324 1.3912 6.3548 12.0268 11.3405 4.6300 2.0183 3.5504 0.3127 4.1531 0.6067 3.6481 1.1437 0.3191 9.7306 7.8965 0.1957 7.8655 8.4994 7.0358 6.9116 17.9541 30.3092 10.6347 16.9583 20.6979 7.4831 6.3899 2.6131 9.1075 2.0190 1.2990 7.5861 2.4495 5.3452 12.8414 4.4416 6.3364 10.4325 11.1979 17.6691 16.3854 21.4630 57.7588 47.9438 97.8292 29.4371 13.8509 7.4490 101.4817 34.6177 40.1191 26.5103 34.7467 32.9908 11.4348 23.0055 16.2570 49.3234 33.5223 7.6215 89.1038 1.0971 20.7732 13.3164 13.4290 98.5915 40.2498 45.4643 75.2038 103.5352 40.1637 14.6638 21.9599 30.4329
temp: 298.150 k
press: 1.00000 atm
elementType: 8 8 6 6 6 6 6 6 6 6 6 6 6 6 6 6 6 6 1 1 1 1 1 1 1 1 1 1 1 1 1 1 1 1 1 1 1 1 1 1 1 1 1 1 1 1 1 1 1 1
symmnumber: 1
zpe: 1184822.4 jmol-1
zpe.correction: 0.451275 hartree
zpe.thermalcorrener: 0.473621 hartree
zpe.thermalcorrenthalpy: 0.474565 hartree
zpe.thermalcorrgfe: 0.398686 hartree
zpe.sumelectzpe: -777.831718 hartree
zpe.sumelectthermal: -777.809372 hartree
zpe.sumelectthermalent: -777.808428 hartree
zpe.sumelectthermalfe: -777.884307 hartree
dipole: 2.1029 0.2390 -0.1793
dipole: 2.1240
quadrupole: -107.9104 -116.9397 -113.9378
quadrupole: -0.6123 1.5361 2.2292
quadrupole: 5.0189 -4.0104 -1.0085 -0.6123 1.5361 2.2292
hfenergy: -778.2829929 hartree
pointgroup: C01 [X(C16H32O2)]
dipole: 0.8300342 0.0660553 -0.0705322 debye
polarizability: 197.4575151|2.3036904|175.6752368|5.1707924|-1.3713256|162.6748857 unknown
InChI: InChI=1S/C16H32O2/c1-6-7-8-9-10-11-14-17-12-16(4,5)15(18-14)13(2)3/h13-15H,6-12H2,1-5H3
charge 0 multiplicity 1
50 atoms
O  1.062273 -0.134988 -0.779118
O  1.01559 -2.074724 0.633734
C  2.750222 -0.266676 1.05196
C  2.455931 0.249129 -0.405464
C  2.501007 1.771177 -0.709861
C  2.388254 -1.787694 1.069685
C  0.831355 -1.572075 -0.728198
C  4.259925 -0.212767 1.408312
C  1.897432 0.484126 2.100551
C  -0.599883 -1.862706 -1.171484
C  2.239913 1.999094 -2.220999
C  3.814908 2.478383 -0.300452
C  -1.679505 -1.160708 -0.318522
C  -3.108359 -1.532176 -0.776734
C  -4.232424 -0.89306 0.075163
C  -4.312335 0.648179 -0.030075
C  -5.506248 1.247196 0.748023
C  -5.586018 2.785594 0.640225
H  3.158829 -0.281585 -1.096078
H  1.662856 2.228428 -0.146939
H  2.458755 -2.183545 2.097261
H  3.103196 -2.343213 0.417844
H  1.585577 -2.074043 -1.386313
H  4.595904 0.803608 1.663387
H  4.888402 -0.581192 0.574671
H  4.461192 -0.854898 2.288083
H  2.073644 0.068405 3.110732
H  0.823627 0.381294 1.867961
H  2.148995 1.559702 2.131193
H  -0.695911 -1.555397 -2.231173
H  -0.741755 -2.960428 -1.133881
H  1.315905 1.49128 -2.540766
H  2.14401 3.07895 -2.438609
H  3.08183 1.607274 -2.82563
H  3.927621 2.567672 0.793287
H  3.823672 3.502518 -0.716963
H  4.702297 1.950036 -0.697723
H  -1.542142 -1.446095 0.742196
H  -1.52446 -0.068139 -0.379947
H  -3.244036 -1.23487 -1.838723
H  -3.217192 -2.63673 -0.746351
H  -4.093382 -1.180174 1.138663
H  -5.208718 -1.31921 -0.237213
H  -3.373597 1.102436 0.345448
H  -4.391481 0.935639 -1.100039
H  -5.429127 0.953097 1.815023
H  -6.448423 0.798962 0.370513
H  -5.692596 3.102799 -0.414559
H  -6.447655 3.189124 1.203753
H  -4.668776 3.258395 1.039844
