program: Gaussian 09
title: 000229676
version: EM64L-G09RevD.01
frameworkgroup: C1[X(C16H26O)]
method: RPBEPBE
basis: SDD
operation: Freq
keyword: #pfreq=noraman
keyword: PBEPBE/SDD
title: #p freq=noraman PBEPBE/SDD
converged: YES YES NO NO
title: Mulliken charges:
elementType: O C C C C C C C C C C C C C C C C H H H H H H H H H H H H H H H H H H H H H H H H H H
charge: -0.469866 0.306434 0.131420 -0.463361 -0.066211 0.493325 -0.782028 -0.723682 -0.745219 -0.732536 -0.728571 -0.412613 -0.415112 -0.424529 -0.417498 0.438413 -0.810554 0.231338 0.190259 0.178789 0.195639 0.242489 0.247540 0.212534 0.224504 0.209877 0.228974 0.225166 0.193871 0.243436 0.204823 0.217160 0.207776 0.212268 0.233326 0.322892 0.219100 0.251226 0.225558 0.224184 0.223159 0.233956 0.222340
chargesum: 0.00000
title: Mulliken charges with hydrogens summed into heavy atoms:
elementType: O C C C C C C C C C C C C C C C C
charge: -0.146974 0.306434 0.131420 -0.041764 0.112578 0.493325 -0.096360 -0.076766 -0.097208 -0.067117 -0.075201 -0.193513 -0.163886 -0.198971 -0.193314 0.438413 -0.131098
polarizability: 2.07654943e+02 -1.74900739e+01 1.63490564e+02 -1.11559515e+01 -9.67607861e+00 1.50729667e+02
1716.lowfreq: -22.6395 -14.8170 -12.5318 -7.9557 -0.0005 -0.0003 0.0005 35.9861 43.3748
frequency: -14.7582 34.9472 43.2297 55.4610 91.9112 113.3550 144.5307 184.8487 187.4299 199.2820 226.8608 235.0218 241.8666 242.8839 259.6717 275.7559 290.5799 296.3173 323.2524 329.4485 343.2674 347.9742 370.9084 394.1310 408.0311 414.3343 445.9349 465.3213 481.9706 499.6719 527.4371 571.7352 639.2048 655.8227 715.7124 734.5861 788.2116 804.6868 827.8156 850.1146 857.7951 863.7853 910.0411 915.7881 921.1481 930.6846 951.8903 954.0411 968.0221 974.6305 983.4968 1005.9852 1012.3843 1046.9097 1050.8963 1057.8963 1097.8224 1104.4993 1126.4128 1132.2669 1147.1917 1156.6316 1193.8846 1197.9790 1203.5343 1226.3820 1232.2369 1272.8639 1304.1577 1312.3053 1317.8044 1338.4939 1359.5335 1367.5367 1373.6638 1376.3688 1385.1803 1393.6245 1396.3943 1399.8126 1407.0067 1440.3580 1457.0729 1459.1578 1466.0684 1467.6097 1471.8259 1472.4429 1472.5624 1477.1399 1480.2735 1483.4088 1485.6952 1494.4274 1508.5525 1577.0979 1624.2737 2919.8892 2969.5150 2971.1603 2972.2449 2975.3710 2978.4880 2982.9322 2988.1759 3043.0893 3052.8739 3063.4973 3066.7091 3068.4654 3072.0308 3073.9430 3078.0515 3079.2790 3081.3189 3086.5197 3098.3447 3104.9952 3109.7407 3112.2145 3130.0426 3152.3103 3531.4751
redmass: 1.0119 3.4073 3.7525 3.4885 2.6029 2.9587 3.2960 2.6660 2.9756 1.1467 1.2980 2.0492 1.6090 1.0442 2.7678 1.8920 1.2512 2.2247 1.3841 2.2120 1.8704 2.3034 2.0483 2.5848 2.8294 2.7976 2.8379 3.1434 2.9505 2.7342 2.8093 2.6959 6.9353 3.6211 3.2785 2.8239 3.4647 3.5423 1.5719 1.2517 2.1605 2.6293 1.3452 1.7970 1.7417 1.5338 1.3783 1.3438 1.7075 1.4303 1.4115 1.5033 2.3370 1.5527 1.3850 1.9095 2.0788 2.5214 1.5173 1.7043 2.0329 2.2775 2.2574 1.2909 2.0015 2.9891 2.2969 1.6901 1.4366 1.3121 1.5055 1.3759 4.6745 1.5943 1.2791 1.2148 1.2229 1.2079 1.2289 1.5407 1.9644 1.0823 1.0555 1.0568 1.0577 1.0573 1.0867 1.0552 1.0542 1.0491 1.0509 1.0544 1.0627 1.0539 2.4868 5.7858 6.3417 1.0828 1.0347 1.0437 1.0385 1.0357 1.0370 1.0406 1.0552 1.1002 1.0951 1.0991 1.0996 1.0978 1.0934 1.0992 1.0980 1.0980 1.0996 1.0994 1.0987 1.0861 1.0980 1.0890 1.0957 1.0939 1.0654
irintensity: 0.5134 0.2112 0.1618 0.2075 0.5125 1.1013 0.3069 0.6138 0.5483 0.1353 0.4175 0.5303 4.3132 0.9062 1.0787 1.0513 5.6297 6.2582 77.0230 17.9967 13.1150 7.7065 2.5021 1.7492 0.0904 6.6370 1.0780 6.2723 1.1424 16.0398 0.9667 16.4950 0.0363 1.7196 10.1896 3.8589 1.5559 4.1165 44.9349 0.8114 4.4326 22.7381 2.6381 2.8067 2.8878 1.6562 1.9089 1.6986 4.3641 2.0469 0.1152 1.3814 10.1553 18.0998 24.1085 14.9259 33.0789 17.4991 37.2255 13.6043 9.9474 6.3141 4.7248 3.9276 7.0424 3.8665 20.9602 19.4800 0.2321 0.8052 3.4072 7.0493 2.6329 25.0285 9.7977 12.9375 40.3244 8.3985 8.2681 7.1339 13.0025 2.2687 7.3854 0.2841 7.8721 15.0627 14.8688 9.6698 4.3554 25.5756 11.0312 0.9009 25.1819 14.1817 45.3823 0.8541 0.0884 36.9883 30.3468 37.0594 44.3481 26.5679 17.8715 48.8186 18.4264 15.8796 23.3870 2.4295 39.1333 62.9930 76.5138 11.3406 25.8612 76.6322 19.7748 22.6381 34.8170 18.2293 15.2683 24.8923 30.6191 9.8644 4.2274
temp: 298.150 k
press: 1.00000 atm
elementType: 8 6 6 6 6 6 6 6 6 6 6 6 6 6 6 6 6 1 1 1 1 1 1 1 1 1 1 1 1 1 1 1 1 1 1 1 1 1 1 1 1 1 1
symmnumber: 1
zpe: 992261.4 jmol-1
zpe.correction: 0.377932 hartree
zpe.thermalcorrener: 0.396962 hartree
zpe.thermalcorrenthalpy: 0.397907 hartree
zpe.thermalcorrgfe: 0.332305 hartree
zpe.sumelectzpe: -699.182525 hartree
zpe.sumelectthermal: -699.163495 hartree
zpe.sumelectthermalent: -699.162550 hartree
zpe.sumelectthermalfe: -699.228152 hartree
dipole: 0.0768 -1.7029 -0.3300
dipole: 1.7362
quadrupole: -102.1140 -106.7435 -102.3226
quadrupole: 1.8025 -0.0155 -0.4310
quadrupole: 1.6127 -3.0168 1.4041 1.8025 -0.0155 -0.4310
hfenergy: -699.5604571 hartree
pointgroup: C01 [X(C16H26O1)]
dipole: -0.0054076 -0.6829849 -0.0108874 debye
polarizability: 205.9857035|-21.2347505|161.9192405|-6.9054146|-11.5143456|153.9702301 unknown
InChI: InChI=1S/C16H26O/c1-12(2)16(6,17)11-15(4,5)14-9-7-13(3)8-10-14/h7-10,12,17H,11H2,1-6H3
charge 0 multiplicity 1
43 atoms
O  -2.738221 0.65126 -1.637011
C  -2.118475 -0.253552 -0.615083
C  -0.23661 1.539882 0.201104
C  -1.542172 0.704354 0.4612
C  -3.276947 -1.144312 -0.023691
C  1.035994 0.657935 0.166149
C  -1.075933 -1.141867 -1.328751
C  -0.091766 2.507059 1.423091
C  -0.387131 2.420938 -1.065715
C  -4.397348 -0.310271 0.642171
C  -2.784355 -2.256744 0.934164
C  1.3136 -0.250641 1.223942
C  1.996188 0.742588 -0.873396
C  2.482399 -1.039759 1.235975
C  3.169774 -0.045059 -0.862031
C  3.439493 -0.951332 0.192163
C  4.715465 -1.775969 0.219878
H  -2.343555 1.435531 0.679612
H  -1.395113 0.11886 1.389161
H  -3.72303 -1.65314 -0.909915
H  -1.586221 -1.859839 -2.002409
H  -0.459395 -1.716795 -0.618182
H  -0.392167 -0.525344 -1.933329
H  -0.03566 1.953276 2.37839
H  0.827959 3.112741 1.329471
H  -0.957145 3.194609 1.473704
H  -0.461124 1.824644 -1.98948
H  -1.319408 3.007579 -0.997623
H  0.459931 3.127274 -1.15669
H  -4.69294 0.536641 -0.001415
H  -5.288094 -0.940134 0.824266
H  -4.073283 0.092764 1.619466
H  -2.291535 -1.831027 1.828443
H  -3.642505 -2.858086 1.287339
H  -2.070891 -2.942956 0.44547
H  -3.118146 0.079516 -2.354019
H  0.605754 -0.352424 2.05586
H  1.831295 1.42504 -1.71308
H  2.656636 -1.73352 2.068421
H  3.886413 0.046655 -1.68837
H  5.082951 -1.987373 -0.799995
H  5.524454 -1.24211 0.756153
H  4.563564 -2.741292 0.734791
