program: Gaussian 09
title: 000229659
version: EM64L-G09RevD.01
frameworkgroup: C1[X(C11H22O2)]
method: RPBEPBE
basis: SDD
operation: Freq
keyword: #pfreq=noraman
keyword: PBEPBE/SDD
title: #p freq=noraman PBEPBE/SDD
converged: NO YES NO NO
title: Mulliken charges:
elementType: O O C C C C C C C C C C C H H H H H H H H H H H H H H H H H H H H H H
charge: -0.248575 -0.248454 0.277543 -0.368338 -0.368234 0.055006 -0.443843 -0.695151 -0.733119 -0.409738 -0.335283 -0.358947 -0.694844 0.182981 0.228411 0.228367 0.183032 0.191080 0.225543 0.225772 0.258202 0.202421 0.202369 0.219309 0.210463 0.219238 0.197440 0.197638 0.187677 0.187350 0.194527 0.194695 0.210278 0.214943 0.210240
chargesum: 0.00000
title: Mulliken charges with hydrogens summed into heavy atoms:
elementType: O O C C C C C C C C C C C
charge: -0.248575 -0.248454 0.277543 0.043054 0.043165 0.246086 0.007473 -0.032160 -0.084109 -0.014660 0.039745 0.030274 -0.059382
polarizability: 1.59609775e+02 4.74690488e-02 1.07642538e+02 -2.26577971e+00 -3.79981291e-02 1.08957519e+02
1716.lowfreq: -42.4320 -14.2787 -0.0005 -0.0004 0.0003 6.6910 19.5590 46.3725 48.0704
frequency: -41.6562 46.3323 47.3654 92.6417 115.2058 126.5472 161.9122 183.0244 209.1083 217.3117 229.2755 247.9809 264.1804 302.2607 323.0490 341.6573 405.6042 407.4025 429.8603 488.3576 493.5218 563.8685 636.2422 719.3125 735.2439 771.7686 793.9793 861.3819 880.5210 899.2673 902.5047 919.0351 939.0677 939.8369 954.2194 970.3567 993.0299 1016.7678 1021.2159 1049.9285 1062.8537 1080.8770 1098.9450 1129.1948 1131.2590 1179.3709 1197.5357 1201.4422 1209.5871 1239.7985 1262.2567 1272.2503 1290.0036 1292.4416 1294.5519 1307.1846 1316.4916 1340.1157 1348.3930 1357.7399 1359.1304 1375.5388 1383.7290 1388.2451 1399.6238 1448.6940 1453.2815 1455.1504 1464.4108 1466.6788 1469.9456 1471.8138 1476.1005 1479.0663 1479.3226 1487.1929 1488.2738 2860.3378 2916.8482 2926.6321 2953.7719 2960.3051 2966.5347 2968.7965 2970.2121 2976.4951 2991.1515 3005.6104 3009.8534 3032.2427 3059.0447 3061.5403 3065.5804 3066.5600 3069.6099 3071.1670 3071.8770 3072.1637 3098.5360
redmass: 2.8689 3.3337 2.3608 1.8405 3.3046 1.9778 1.0304 3.5812 2.3270 1.3829 1.1166 3.7522 2.0887 3.0981 2.3630 2.5646 2.0026 1.9905 3.0850 5.6334 3.2045 5.3799 4.0395 1.2187 1.1629 3.6115 1.6304 1.5401 2.6492 1.9675 2.7196 2.2826 1.4319 1.3977 4.9257 1.2724 2.7783 3.5782 1.4422 2.5770 3.2034 2.4185 2.1343 1.5083 2.6703 2.1284 1.4004 1.8536 1.4471 1.3228 1.3801 1.7705 1.0524 1.4111 1.1274 1.6255 1.1506 1.4147 1.1973 1.3764 1.5515 1.2395 1.6446 1.2197 1.2107 1.0804 1.0703 1.0715 1.0738 1.0471 1.0717 1.0786 1.0426 1.0731 1.0573 1.0600 1.0867 1.0831 1.0676 1.0678 1.0589 1.0591 1.0358 1.0577 1.0377 1.0370 1.0981 1.0596 1.1020 1.1042 1.0986 1.0989 1.0975 1.1009 1.0993 1.0971 1.1020 1.0961 1.0979
irintensity: 0.0338 0.5664 0.1729 0.0807 0.1166 0.1015 0.1004 0.4477 1.5604 0.9320 0.0002 4.6892 1.1006 3.7063 4.3655 1.3861 0.8657 0.8083 4.9105 3.2437 0.3233 1.5706 7.0388 0.0502 18.3748 2.8709 21.2721 28.4260 23.5861 27.6262 4.8798 6.9229 14.3646 3.4218 7.1787 6.2352 37.4350 5.4666 0.7410 75.7097 41.0032 12.7561 59.2070 12.5559 7.2744 4.6454 1.2587 0.3663 4.3215 2.9381 0.2015 3.2295 0.0180 3.3219 1.8780 8.0658 3.2876 3.6282 2.6948 3.1557 2.5786 22.8914 32.4666 9.6760 16.9544 6.2844 2.8223 4.5888 0.4437 0.0794 0.6647 17.9118 12.2998 4.3615 11.4520 24.2520 19.0032 69.4674 24.7427 117.4954 1.3759 4.8014 38.9626 118.4932 30.0198 30.9756 0.0754 21.5983 0.3110 53.9384 25.7769 0.8881 0.0429 63.3994 55.9793 53.6685 101.3835 40.6877 18.1298
temp: 298.150 k
press: 1.00000 atm
elementType: 8 8 6 6 6 6 6 6 6 6 6 6 6 1 1 1 1 1 1 1 1 1 1 1 1 1 1 1 1 1 1 1 1 1 1
symmnumber: 1
zpe: 819642.4 jmol-1
zpe.correction: 0.312185 hartree
zpe.thermalcorrener: 0.326844 hartree
zpe.thermalcorrenthalpy: 0.327788 hartree
zpe.thermalcorrgfe: 0.270830 hartree
zpe.sumelectzpe: -581.715727 hartree
zpe.sumelectthermal: -581.701068 hartree
zpe.sumelectthermalent: -581.700124 hartree
zpe.sumelectthermalfe: -581.757082 hartree
dipole: 1.2962 0.0306 -1.7362
dipole: 2.1669
quadrupole: -73.6821 -84.7838 -82.4234
quadrupole: 0.0765 -2.5556 -0.0272
quadrupole: 6.6143 -4.4874 -2.1270 0.0765 -2.5556 -0.0272
hfenergy: -582.0279121 hartree
pointgroup: C01 [X(C11H22O2)]
dipole: 0.5172315 -0.2086768 0.644755 debye
polarizability: 159.6168015|-1.8119887|107.8142256|1.2409036|-0.3917317|108.7788049 unknown
InChI: InChI=1S/C11H22O2/c1-4-5-6-7-10-12-8-11(2,3)9-13-10/h10H,4-9H2,1-3H3
charge 0 multiplicity 1
35 atoms
O  1.047509 1.139196 0.049832
O  0.974799 -1.177575 -0.640985
C  3.189015 -0.161418 -0.045886
C  2.37278 0.950274 0.670162
C  2.298747 -1.434786 -0.041908
C  0.28126 -0.111048 0.089284
C  -1.080443 0.127668 -0.567487
C  3.515489 0.262269 -1.497293
C  4.483251 -0.439809 0.751973
C  -2.275124 -0.126341 0.377858
C  -3.636566 0.115015 -0.310655
C  -4.845059 -0.139258 0.618637
C  -6.200883 0.099918 -0.080432
H  2.242295 0.686531 1.745686
H  2.875199 1.929469 0.596601
H  2.744846 -2.240813 -0.648515
H  2.165815 -1.796248 1.004471
H  0.205025 -0.427994 1.161143
H  -1.150237 -0.533747 -1.450712
H  -1.101038 1.171042 -0.932597
H  2.588283 0.455823 -2.06222
H  4.128454 1.183512 -1.50874
H  4.082842 -0.531419 -2.019412
H  5.124547 0.461051 0.787735
H  4.26578 -0.744365 1.794263
H  5.07048 -1.248227 0.277008
H  -2.236356 -1.170264 0.752377
H  -2.193449 0.53339 1.266409
H  -3.677511 1.158711 -0.687283
H  -3.716776 -0.540487 -1.203228
H  -4.801024 -1.181444 0.996347
H  -4.765045 0.517773 1.508909
H  -6.28229 1.143357 -0.440024
H  -7.04919 -0.089551 0.603046
H  -6.316525 -0.565908 -0.956763
