program: Gaussian 09
title: 000229655
version: EM64L-G09RevD.01
frameworkgroup: C1[X(C11H14O2)]
method: RPBEPBE
basis: SDD
operation: Freq
keyword: #pfreq=noraman
keyword: PBEPBE/SDD
title: #p freq=noraman PBEPBE/SDD
converged: YES YES NO NO
title: Mulliken charges:
elementType: O O C C C C C C C C C C C H H H H H H H H H H H H H H
charge: -0.274840 -0.280417 -0.064703 -0.464635 -0.468424 -0.295035 -0.331815 0.370868 -0.347278 -0.381202 -0.223802 -0.197170 -0.257535 0.242666 0.248675 0.223981 0.232992 0.222389 0.198205 0.223138 0.210886 0.237571 0.250948 0.247948 0.222928 0.226372 0.227286
chargesum: 0.00000
title: Mulliken charges with hydrogens summed into heavy atoms:
elementType: O O C C C C C C C C C C C
charge: -0.274840 -0.280417 0.177963 0.008021 -0.013043 0.126309 0.116641 0.370868 -0.096329 -0.133254 -0.000873 0.029203 -0.030249
polarizability: 1.69781239e+02 -2.57908724e+00 1.16038339e+02 -4.19691069e+00 -6.10123293e+00 7.60398318e+01
1716.lowfreq: -15.0710 -4.6074 -2.3841 0.0007 0.0008 0.0010 33.0794 44.7105 63.5736
frequency: 32.8415 44.5975 63.5092 94.9943 137.5755 215.9355 231.5658 241.9516 283.1752 406.5489 414.4830 472.0025 503.8119 565.5768 589.4038 610.2227 680.8204 692.9623 758.9727 780.1982 822.4139 828.8001 845.3855 872.2562 889.1316 894.7332 915.9376 960.8701 971.9900 981.3853 985.6278 994.8349 1005.3595 1022.2927 1028.0246 1082.1184 1088.3364 1130.7234 1144.1677 1166.3935 1172.1847 1179.8334 1200.8167 1217.7336 1229.8118 1259.2257 1299.9049 1311.6724 1313.8281 1331.1258 1343.5314 1373.1021 1390.8173 1443.4270 1465.6676 1467.5251 1475.8568 1483.0113 1491.3500 1591.5106 1611.7836 2963.8270 2970.8409 3011.8728 3013.9026 3027.8712 3043.6007 3068.1072 3080.6945 3094.8045 3127.3698 3135.8427 3154.1700 3162.1102 3171.8250
redmass: 4.0237 3.7704 3.0680 5.2020 3.3932 2.2539 5.2207 2.6355 5.0100 2.3885 2.6911 4.4072 2.8552 5.0864 2.1449 6.4342 4.7062 2.0988 1.6529 6.0147 1.3560 1.9041 2.4083 2.6358 1.5508 1.5952 2.5557 1.3630 5.8948 1.3080 5.2368 1.7532 1.9713 2.0604 3.5718 1.5206 1.4311 1.5434 1.2446 1.1134 1.4758 1.2755 1.2717 2.8257 1.4806 1.2530 1.3951 1.2607 1.3288 1.3093 1.3416 1.7799 4.2474 2.3521 1.1661 1.1372 1.2858 1.4791 1.0957 6.4471 6.2704 1.0572 1.0666 1.0622 1.0687 1.0881 1.0996 1.0979 1.1018 1.1052 1.0847 1.0889 1.0923 1.0956 1.1008
irintensity: 0.8770 1.4902 0.3906 2.4805 5.8238 1.4574 0.5522 2.0056 8.4689 0.4479 0.4015 5.0962 12.5283 1.8628 7.5071 0.6536 3.8837 35.8260 90.1599 13.5939 3.0619 9.1289 5.6929 8.5480 3.2902 12.9799 11.8712 0.0378 41.2659 0.7324 7.2589 40.1340 4.2443 17.8248 106.5633 13.7813 3.9777 0.7628 1.9509 16.8609 20.0023 26.9394 5.5302 246.0771 2.7645 0.6822 7.0938 2.0188 0.7995 2.1575 7.2353 3.5454 8.4916 2.8339 44.6143 43.9918 50.2555 24.9474 1.5654 24.4342 82.6988 28.9093 94.6915 23.5842 7.7278 26.3327 60.6452 30.9760 18.1521 58.4762 2.9116 11.9553 31.1697 22.0177 7.1414
temp: 298.150 k
press: 1.00000 atm
elementType: 8 8 6 6 6 6 6 6 6 6 6 6 6 1 1 1 1 1 1 1 1 1 1 1 1 1 1
symmnumber: 1
zpe: 592944.0 jmol-1
zpe.correction: 0.225840 hartree
zpe.thermalcorrener: 0.237627 hartree
zpe.thermalcorrenthalpy: 0.238571 hartree
zpe.thermalcorrgfe: 0.186283 hartree
zpe.sumelectzpe: -577.011501 hartree
zpe.sumelectthermal: -576.999714 hartree
zpe.sumelectthermalent: -576.998770 hartree
zpe.sumelectthermalfe: -577.051057 hartree
dipole: 0.9844 0.2537 1.7735
dipole: 2.0442
quadrupole: -68.0235 -73.6155 -81.9172
quadrupole: 3.4391 4.7105 -3.0763
quadrupole: 6.4953 0.9032 -7.3985 3.4391 4.7105 -3.0763
hfenergy: -577.237341 hartree
pointgroup: C01 [X(C11H14O2)]
dipole: 0.4005697 0.3308851 0.6139124 debye
polarizability: 169.6030836|-4.3453213|107.4955117|-4.8299112|-17.4111515|84.7608144 unknown
InChI: InChI=1S/C11H14O2/c1-2-5-10(6-3-1)13-9-11-7-4-8-12-11/h1-3,5-6,11H,4,7-9H2
charge 0 multiplicity 1
27 atoms
O  3.190398 -1.029761 -0.624919
O  -0.180697 0.485448 -0.567729
C  2.184949 0.05936 -0.78735
C  2.747344 1.287983 -0.032543
C  3.690767 0.656245 1.025639
C  4.284621 -0.537125 0.251984
C  0.869419 -0.483535 -0.21304
C  -1.498684 0.193835 -0.176328
C  -1.879227 -0.966133 0.544062
C  -2.471095 1.154493 -0.551977
C  -3.23995 -1.152259 0.884251
C  -3.821567 0.953249 -0.205751
C  -4.216089 -0.201319 0.515412
H  2.054553 0.25461 -1.867114
H  1.93964 1.897743 0.40539
H  3.32551 1.926531 -0.724579
H  4.464235 1.358577 1.379823
H  3.116164 0.303704 1.901545
H  5.141132 -0.219588 -0.377539
H  4.595544 -1.38091 0.890939
H  0.936334 -0.593057 0.889024
H  0.652591 -1.472475 -0.661813
H  -1.140751 -1.718014 0.83775
H  -2.148118 2.038582 -1.110638
H  -3.532646 -2.049989 1.440766
H  -4.568944 1.698504 -0.500438
H  -5.266837 -0.3547 0.782574
