program: Gaussian 09
title: 000229642
version: EM64L-G09RevD.01
frameworkgroup: C1[X(C13H21NO7)]
method: RPBEPBE
basis: SDD
operation: Freq
keyword: #p
keyword: freq=noraman
keyword: PBEPBE/SDD
title: #p freq=noraman PBEPBE/SDD
converged: YES YES NO NO
title: Mulliken charges:
elementType: O O O O O O O N C C C C C C C C C C C C C H H H H H H H H H H H H H H H H H H H H H
charge: -0.248776 -0.247841 -0.272929 -0.265688 -0.263775 -0.263397 -0.247733 -0.134377 -0.415534 -0.388634 0.212342 -0.076208 -0.333789 -0.300448 -0.712539 0.317056 0.316498 0.305226 -0.756469 -0.757727 -0.779158 0.296047 0.231319 0.251991 0.270678 0.245503 0.301480 0.230223 0.245170 0.238878 0.259694 0.237468 0.213306 0.263116 0.248275 0.243076 0.252195 0.255597 0.245698 0.304239 0.238587 0.241357
chargesum: 0.00000
title: Mulliken charges with hydrogens summed into heavy atoms:
elementType: O O O O O O O N C C C C C C C C C C C C C
charge: -0.248776 -0.247841 -0.272929 -0.265688 -0.263775 -0.263397 -0.247733 -0.134377 0.111832 0.134036 0.212342 0.169295 0.197915 0.183600 -0.002070 0.317056 0.316498 0.305226 -0.002002 -0.004237 0.005025
polarizability: 2.13623774e+02 -1.27233474e+01 1.62902452e+02 7.75704338e-01 4.94766036e+00 1.40959245e+02
1716.lowfreq: -36.8366 -5.9876 -4.3440 0.0006 0.0008 0.0009 5.4314 22.0554 33.2179
frequency: -36.8282 21.9287 33.1469 37.3272 39.8196 52.5914 59.4205 66.5528 70.4481 75.0074 80.8135 92.9412 96.0774 115.1912 145.8071 156.2079 159.0488 208.0991 215.3168 235.5489 254.1336 280.0799 288.8642 301.7375 316.2125 329.9444 363.1646 393.7200 407.4246 427.0733 447.1165 477.9657 530.4695 565.3908 575.2341 579.8160 600.3570 610.9458 628.1449 655.8110 706.3901 746.6718 765.8468 782.3555 800.5630 808.3508 844.2284 906.7552 929.2856 955.3293 962.0902 998.1194 999.7771 1005.4501 1015.2124 1038.3641 1039.0851 1044.2956 1048.9081 1056.9861 1070.1191 1076.6997 1103.2923 1140.0723 1182.0753 1191.1452 1197.7322 1207.8777 1215.0200 1244.3379 1278.5868 1293.1480 1298.6197 1319.9178 1336.1177 1361.5786 1364.9445 1383.2236 1384.8344 1386.9588 1390.3234 1393.4960 1414.3916 1436.2150 1447.6017 1453.0191 1453.2844 1455.7255 1456.5201 1457.6507 1461.5536 1467.8408 1473.6721 1476.3779 1513.0669 1591.5610 1634.4232 1638.6685 1655.0411 2996.9579 2997.7991 3008.1480 3009.1765 3013.5598 3030.3882 3032.8056 3041.6215 3057.1868 3080.0253 3093.5745 3095.3922 3096.9049 3098.3485 3101.0185 3113.8553 3120.1335 3127.1370 3137.2108 3141.6913 3142.5491
redmass: 1.0591 4.4563 5.0017 4.7002 7.0228 6.5581 4.4631 1.5356 3.9922 3.1378 3.4789 4.3414 5.2404 3.7245 2.4653 1.2882 3.5549 3.4881 1.1977 2.9894 3.7526 2.6632 4.2024 2.9197 4.4993 5.3763 3.8516 3.2446 2.8220 3.0558 3.3857 3.1651 2.8072 3.2517 3.3626 3.3466 4.4047 4.3623 4.9281 3.8543 6.5565 3.7540 3.6125 2.5772 3.1934 1.6229 2.9459 4.3743 3.6684 5.7963 2.4129 1.9912 1.7775 1.9089 2.0715 3.4851 3.3505 1.6652 1.7066 1.6390 1.9179 2.1160 2.2729 2.3233 2.7458 2.4375 2.0720 3.2741 2.7581 1.2918 1.3557 1.2255 1.4096 1.2672 1.2238 1.2832 1.3275 1.2700 1.2391 1.2608 1.2432 1.2396 2.0770 1.0983 1.1022 1.0589 1.0566 1.0613 1.0558 1.0470 1.0484 1.0596 1.0944 1.0617 1.0928 7.4490 9.2761 9.4680 8.9772 1.0389 1.0355 1.0379 1.0368 1.0609 1.0616 1.0604 1.0631 1.0818 1.1014 1.0937 1.0991 1.0969 1.1026 1.0947 1.1012 1.1063 1.1076 1.1018 1.1012 1.1022
irintensity: 1.1028 0.0663 0.3564 0.7174 0.6870 4.1333 2.1637 1.6844 0.9726 0.1942 1.8399 2.5378 0.9035 8.2797 6.3893 3.8492 5.2171 2.4603 1.9344 2.2909 2.6563 10.0482 12.1549 13.5639 2.6893 5.7662 10.0636 11.9618 9.8874 9.3433 14.6473 6.7828 12.8696 1.6634 4.2157 4.9568 6.0373 7.6815 1.8818 2.9947 6.7876 24.7699 5.0590 19.9294 7.8314 1.8612 9.2875 13.6390 43.5099 68.7463 19.9277 51.2882 38.9754 84.6879 35.3372 27.2107 46.4184 8.2624 9.1971 19.2710 57.2109 47.9930 66.5415 8.1126 83.8879 141.2662 107.3470 369.2492 211.3907 3.5246 52.2725 9.1456 15.9509 3.2048 6.5514 0.5327 0.4629 6.1026 67.3838 51.7388 37.0886 44.6818 62.2770 27.0857 29.5785 24.8528 19.2257 21.3063 0.1296 18.7161 13.1816 32.1364 16.4237 20.6231 11.6847 261.7429 280.2278 130.9769 159.0522 20.2616 14.8866 1.1962 2.4072 18.2996 2.6817 20.3752 25.6440 19.7926 7.0981 8.0821 26.6089 5.6986 1.6850 7.8658 13.8130 8.2122 5.8621 9.3839 8.0296 8.0736
temp: 298.150 k
press: 1.00000 atm
elementType: 8 8 8 8 8 8 8 7 6 6 6 6 6 6 6 6 6 6 6 6 6 1 1 1 1 1 1 1 1 1 1 1 1 1 1 1 1 1 1 1 1 1
symmnumber: 1
zpe: 880996.9 jmol-1
zpe.correction: 0.335554 hartree
zpe.thermalcorrener: 0.359485 hartree
zpe.thermalcorrenthalpy: 0.360429 hartree
zpe.thermalcorrgfe: 0.278817 hartree
zpe.sumelectzpe: -1087.676150 hartree
zpe.sumelectthermal: -1087.652218 hartree
zpe.sumelectthermalent: -1087.651274 hartree
zpe.sumelectthermalfe: -1087.732886 hartree
dipole: 0.5757 3.5845 3.4883
dipole: 5.0348
quadrupole: -120.6148 -123.0341 -124.1385
quadrupole: -3.7711 -7.9161 -1.2235
quadrupole: 1.9810 -0.4383 -1.5427 -3.7711 -7.9161 -1.2235
hfenergy: -1088.0117036 hartree
pointgroup: C01 [X(C13H21N1O7)]
dipole: 1.6009004 0.628001 0.9830645 debye
polarizability: 162.5740529|-8.5642761|211.1952743|3.4750309|-16.6856489|143.716144 unknown
InChI: InChI=1S/C13H21NO7/c1-9(21-12(4)17)13(18)14(5-7-19-10(2)15)6-8-20-11(3)16/h9H,5-8H2,1-4H3
charge 0 multiplicity 1
42 atoms
O  1.460767 -3.493011 1.259412
O  2.068249 1.570899 -0.823191
O  -2.693056 1.795129 0.687932
O  -1.235989 -2.898018 0.842011
O  1.816295 -2.756106 -0.919442
O  0.463152 3.199642 -1.274229
O  -3.881463 2.111979 -1.296837
N  -0.738745 -0.652596 0.450072
C  0.203833 0.488852 0.421604
C  -2.062753 -0.46638 -0.193322
C  -0.420543 -1.927441 0.909297
C  0.955539 -2.131091 1.59918
C  1.016305 0.512772 -0.894818
C  -3.062152 0.348481 0.641283
C  0.811418 -2.113056 3.12443
C  1.823359 -3.68534 -0.076647
C  1.656754 2.885539 -1.049588
C  -3.159387 2.58106 -0.389225
C  2.187099 -5.126685 -0.33367
C  2.827431 3.841242 -0.999893
C  -2.637969 3.99211 -0.28315
H  -0.381219 1.416436 0.520043
H  0.89394 0.447275 1.280484
H  -1.938756 0.009479 -1.183204
H  -2.482406 -1.476004 -0.346124
H  1.709416 -1.408756 1.245487
H  1.569235 -0.42625 -1.047778
H  0.359484 0.720236 -1.758082
H  -4.06985 0.256678 0.198959
H  -3.066843 0.028456 1.694483
H  0.072628 -2.869306 3.437267
H  1.779414 -2.337059 3.603327
H  0.467965 -1.120852 3.468545
H  1.258321 -5.706663 -0.484769
H  2.713723 -5.560459 0.531024
H  2.803159 -5.202222 -1.241784
H  2.967682 4.295103 -1.996951
H  3.751524 3.326534 -0.70118
H  2.605917 4.661537 -0.296105
H  -1.611359 4.020807 -0.69462
H  -2.595114 4.319467 0.767871
H  -3.276303 4.667979 -0.871603
