program: Gaussian 09
title: 000229637
version: EM64L-G09RevD.01
frameworkgroup: C1[X(C17H24NO4P)]
method: RPBEPBE
basis: SDD
operation: Freq
keyword: #p
keyword: freq=noraman
keyword: PBEPBE/SDD
title: #p freq=noraman PBEPBE/SDD
converged: YES YES NO NO
title: Mulliken charges:
elementType: P O O O O N C C C C C C C C C C C C C C C C C H H H H H H H H H H H H H H H H H H H H H H H H
charge: 1.265108 -0.544808 -0.539906 -0.645415 -0.247604 -0.406041 -0.753602 -0.444995 0.129878 0.182130 0.062240 0.042633 0.161587 0.220924 -0.348433 -0.677267 -0.673550 -0.674823 -0.662726 -0.387078 -0.358164 -0.243465 -0.211571 0.283926 0.291569 0.266438 0.258423 0.209793 0.240397 0.270600 0.314168 0.204775 0.229207 0.222786 0.205135 0.257845 0.216123 0.204192 0.234352 0.217651 0.209286 0.226869 0.220586 0.288214 0.231366 0.226062 0.225187
chargesum: 0.00000
title: Mulliken charges with hydrogens summed into heavy atoms:
elementType: P O O O O N C C C C C C C C C C C C C C C C C
charge: 1.265108 -0.544808 -0.539906 -0.645415 -0.247604 -0.091873 -0.178107 0.079866 0.129878 0.182130 0.272033 0.283030 0.161587 0.220924 -0.077833 -0.020500 0.005553 -0.018629 -0.005985 -0.098864 -0.126798 -0.017403 0.013615
polarizability: 3.06975279e+02 3.86536663e+00 1.84179821e+02 1.55799686e+00 2.29927675e+01 2.10566150e+02
1716.lowfreq: -8.3314 -4.1947 -0.0006 0.0007 0.0015 2.2346 9.7169 14.8775 29.5388
frequency: 8.9855 14.7257 28.8321 33.4249 36.2961 41.4381 49.4507 64.5164 84.9011 100.1693 123.6500 138.3085 147.0433 166.8587 181.7704 196.5398 199.6617 215.1118 217.8130 223.0761 226.7857 248.4349 283.2449 305.0104 317.8190 345.4607 351.6499 384.3623 392.5150 420.1141 425.7416 436.2085 456.8771 465.6155 499.1239 533.0221 569.8422 570.7697 586.7942 613.4401 623.7275 645.9711 652.4985 705.0381 758.3362 762.3753 766.1210 783.9430 810.4573 828.8471 830.0298 841.3034 866.6434 867.7429 910.1716 917.9147 921.4505 925.1946 926.2931 937.0190 938.1188 949.5522 982.7548 991.7943 1010.0247 1018.6473 1063.3600 1093.1797 1095.1296 1105.0010 1133.7765 1139.4078 1147.4531 1152.8534 1154.3200 1167.0942 1177.0634 1180.9086 1237.1731 1246.6874 1256.4686 1284.4231 1298.3027 1319.8823 1321.5403 1327.1241 1332.8065 1344.2808 1360.1661 1376.6569 1379.6013 1391.0487 1394.2264 1395.5000 1421.5351 1424.0354 1450.3770 1450.7565 1453.8838 1455.0399 1462.2773 1463.3732 1467.4267 1472.7256 1482.2121 1484.8665 1488.1481 1527.6232 1570.3179 1591.5054 1632.6111 2983.3573 2983.5281 2988.3957 2989.6909 2990.8572 2994.6435 3000.2073 3046.0490 3051.2993 3079.7936 3079.8838 3086.4451 3088.8213 3093.3217 3095.1725 3099.7640 3101.5277 3116.3968 3128.7537 3141.2180 3160.2240 3184.0383 3227.1357 3598.8848
redmass: 4.5892 4.6509 2.8507 3.1134 3.6883 4.2155 4.9628 3.7196 5.3035 2.8018 4.1666 4.6936 3.7012 7.3885 1.0313 5.0033 1.0433 2.6674 4.5174 3.6825 1.1794 1.2313 4.9209 3.2180 3.2520 3.3920 2.9535 4.3747 6.5812 3.0220 2.9248 2.9899 4.7684 3.4323 5.1236 2.7633 2.8020 6.3591 1.3469 5.9114 5.3151 2.7803 3.1040 7.5929 1.2842 5.1763 2.8627 1.8742 3.7790 2.4722 2.1422 4.2977 4.9792 1.4325 2.9126 3.0746 1.2696 3.7152 1.4110 1.3179 1.3689 1.3679 1.9025 1.3127 2.0905 12.6880 4.1312 1.9862 1.6672 1.7253 1.6458 1.1768 1.5756 1.9886 2.1285 1.1501 1.9681 1.9447 1.4992 1.6199 2.0665 1.1248 2.2734 1.2393 1.3808 1.5532 1.3006 1.3945 2.4755 1.2755 1.2588 1.2279 1.2654 4.9465 1.1920 2.0730 1.1942 3.0153 1.0498 1.0507 1.0493 1.0480 1.0484 1.0502 1.0495 3.0869 1.0466 4.7311 7.7371 6.6919 7.1528 1.0355 1.0361 1.0435 1.0362 1.0755 1.0602 1.0865 1.0584 1.0992 1.0989 1.0990 1.0997 1.0989 1.0999 1.1012 1.1008 1.1002 1.1038 1.0859 1.0913 1.0975 1.0966 1.0981 1.0810
irintensity: 2.0553 0.1397 0.2745 0.2419 0.4089 0.4440 1.0770 0.6583 0.3935 4.3510 0.3798 4.4650 9.0251 0.7542 0.0263 4.7132 0.3717 1.6241 13.1136 9.7368 1.5719 1.6872 0.7413 1.7856 3.4883 26.2303 12.2257 7.2052 1.5324 3.6132 11.4181 10.9270 62.6043 16.4590 6.6857 4.7951 19.0406 3.5987 66.2649 3.0560 12.2137 12.8307 53.3462 14.1248 85.4008 11.5971 22.3688 55.7982 2.1841 169.3573 99.7203 127.4324 0.7999 1.7293 117.1705 163.7248 1.4344 55.7303 4.2171 0.3237 0.1252 5.0335 10.0669 0.4802 14.6379 82.0182 22.3777 16.0805 60.5541 124.3512 64.0089 1.2992 13.9740 8.3426 16.8531 5.4750 18.6798 18.4855 6.7102 52.7641 14.3293 3.2279 23.6845 21.5120 19.9615 4.0557 10.0767 5.1673 7.7812 28.1074 31.0546 22.2442 30.9783 96.9145 24.8561 81.4857 6.9250 36.9451 3.0972 6.0543 2.2495 3.2390 10.4045 1.6844 16.7798 0.7857 15.3590 88.4557 225.9458 11.4609 2.0780 19.7216 20.3944 30.5715 22.0803 13.7920 26.4417 10.4679 4.5274 2.7848 12.9008 17.5418 36.6240 53.9653 48.0440 12.7828 38.2404 31.6023 1.9002 0.2839 19.2406 28.8798 7.1468 0.0462 70.1108
temp: 298.150 k
press: 1.00000 atm
elementType: 15 8 8 8 8 7 6 6 6 6 6 6 6 6 6 6 6 6 6 6 6 6 6 1 1 1 1 1 1 1 1 1 1 1 1 1 1 1 1 1 1 1 1 1 1 1 1
symmnumber: 1
zpe: 1001040.7 jmol-1
zpe.correction: 0.381276 hartree
zpe.thermalcorrener: 0.406909 hartree
zpe.thermalcorrenthalpy: 0.407853 hartree
zpe.thermalcorrgfe: 0.321226 hartree
zpe.sumelectzpe: -1357.360415 hartree
zpe.sumelectthermal: -1357.334783 hartree
zpe.sumelectthermalent: -1357.333838 hartree
zpe.sumelectthermalfe: -1357.420465 hartree
dipole: -1.3546 2.4631 6.5994
dipole: 7.1732
quadrupole: -130.9113 -139.3598 -142.2227
quadrupole: -2.1984 -1.9175 2.4530
quadrupole: 6.5866 -1.8618 -4.7247 -2.1984 -1.9175 2.4530
hfenergy: -1357.7416913 hartree
pointgroup: C01 [X(C17H24N1O4P1)]
dipole: -0.2481725 -0.5063591 -2.7652318 debye
polarizability: 306.5643635|-4.284188|177.0515665|6.7877203|16.7100556|218.1053205 unknown
InChI: InChI=1S/C17H24NO4P/c1-12(2)21-23(20,22-13(3)4)10-9-17(19)15-11-18-16-8-6-5-7-14(15)16/h5-8,11-13,18H,9-10H2,1-4H3
charge 0 multiplicity 1
47 atoms
P  2.722375 0.012354 1.277222
O  2.810161 1.261972 0.060676
O  2.801658 -1.499896 0.41207
O  3.833903 0.15159 2.418435
O  -1.823549 0.368669 1.989573
N  -3.363179 -0.561603 -2.311824
C  0.914242 0.053998 1.696339
C  0.02385 -0.081571 0.450041
C  -1.465401 0.070168 0.80501
C  -2.44693 -0.127408 -0.267818
C  4.033671 2.129782 -0.017894
C  4.106702 -2.236081 0.341611
C  -3.898946 -0.003351 -0.158123
C  -4.446925 -0.280952 -1.455494
C  -2.172742 -0.470135 -1.604922
C  4.113058 2.577025 -1.48076
C  3.89861 3.287768 0.981308
C  3.724134 -3.712963 0.203498
C  4.937404 -1.706725 -0.837671
C  -4.777217 0.314727 0.909081
C  -5.831718 -0.252633 -1.722916
C  -6.162693 0.345643 0.651141
C  -6.684628 0.065883 -0.645871
H  0.727849 -0.7605 2.415779
H  0.723832 1.007213 2.216816
H  0.296273 0.692942 -0.293666
H  0.196056 -1.060772 -0.035118
H  4.915648 1.514242 0.25185
H  4.641675 -2.059523 1.29613
H  -1.216004 -0.651543 -2.091533
H  -3.442867 -0.798095 -3.29928
H  4.99968 3.219395 -1.635199
H  4.185508 1.704757 -2.152857
H  3.211906 3.153959 -1.753692
H  4.768642 3.966219 0.900604
H  3.856818 2.901053 2.014031
H  2.982626 3.86913 0.772883
H  4.633807 -4.340031 0.163389
H  3.111316 -4.03631 1.061717
H  3.144402 -3.876212 -0.722365
H  5.877759 -2.281313 -0.929955
H  5.200433 -0.64356 -0.695299
H  4.370607 -1.804398 -1.780478
H  -4.369101 0.527036 1.900274
H  -6.234926 -0.466648 -2.718833
H  -6.857308 0.589235 1.462534
H  -7.76747 0.099061 -0.80924
