program: Gaussian 09
title: 000229618
version: EM64L-G09RevD.01
frameworkgroup: C1[X(C16H14N2O)]
method: RPBEPBE
basis: SDD
operation: Freq
keyword: #p
keyword: freq=noraman
keyword: PBEPBE/SDD
title: #p freq=noraman PBEPBE/SDD
converged: YES YES NO NO
title: Mulliken charges:
elementType: O N N C C C C C C C C C C C C C C C C H H H H H H H H H H H H H H
charge: -0.260276 -0.706265 -0.050526 0.370066 0.533914 0.244054 -0.390768 -0.372981 -0.363636 -0.524131 -0.478044 0.481747 0.318795 -0.370851 -0.365931 -0.210368 -0.432141 -0.301433 -0.537130 0.214543 0.225888 0.248887 0.244259 0.225386 0.251571 0.243179 0.222886 0.221009 0.317298 0.306001 0.224301 0.223791 0.246904
chargesum: 0.00000
title: Mulliken charges with hydrogens summed into heavy atoms:
elementType: O N N C C C C C C C C C C C C C C C C
charge: -0.260276 -0.082966 -0.050526 0.370066 0.533914 0.244054 -0.176225 -0.147093 -0.114749 -0.279872 -0.252657 0.481747 0.318795 -0.119280 -0.122752 0.012518 -0.211132 -0.301433 0.157866
polarizability: 4.19182696e+02 -1.59578509e+01 2.04817702e+02 1.12923835e-01 1.04901233e+00 8.26508704e+01
1716.lowfreq: -2.5841 -0.0007 -0.0006 -0.0004 2.9285 3.4365 22.8299 29.1885 55.2321
frequency: 22.8132 29.1866 55.2304 64.9347 90.1350 130.0164 140.7092 160.2883 196.3489 214.9032 217.9676 251.8222 285.6499 312.3256 351.2712 367.7931 373.1325 399.4436 410.3930 412.0912 428.2736 453.4231 496.5744 516.2784 526.8417 567.0557 603.0734 616.5261 633.1868 656.0555 690.5940 734.4719 743.7270 754.2733 786.3778 793.8801 814.5277 835.5607 866.3048 881.6982 929.7404 938.6525 947.5305 961.4347 968.1434 979.5805 985.6462 994.0196 1011.6894 1056.4900 1107.7294 1112.9945 1123.9693 1159.2712 1183.8222 1187.2295 1198.0755 1242.5025 1255.3681 1310.6084 1312.7782 1333.9607 1348.1852 1384.8045 1405.4684 1430.6812 1437.2784 1467.8374 1469.5440 1473.1731 1487.6288 1504.7240 1571.4683 1583.6449 1587.0347 1620.7111 1624.0516 1645.1862 2149.1745 2962.6098 3051.9771 3113.2300 3120.1877 3127.9948 3130.5820 3138.1666 3141.6405 3155.5371 3165.8610 3170.0784 3174.5091 3565.5883 3706.3960
redmass: 3.6919 5.6803 5.1378 5.0617 3.8554 4.5730 8.5884 6.2417 3.4033 2.8860 2.1861 1.9000 5.1160 3.6624 4.8036 4.0382 1.2583 4.1647 1.3274 2.1161 4.5643 2.7514 4.2462 2.8518 6.0156 7.3494 4.0443 6.3099 7.0024 4.8128 1.6973 3.6241 6.3445 6.3369 1.5522 6.2371 1.2636 1.6977 1.4313 1.6385 1.6042 3.5836 1.3909 1.3630 1.3584 5.6586 7.8946 3.1712 2.2595 1.7211 1.5269 1.2594 1.3697 1.3207 1.1332 1.3032 2.0521 2.4369 3.1225 1.8495 1.2906 2.1578 1.8632 3.7006 4.9055 3.6834 1.1694 1.0499 3.3918 1.0873 2.5947 2.4663 6.1840 5.7673 6.5350 5.6214 4.7429 1.2350 12.6312 1.0328 1.1041 1.0872 1.0861 1.0996 1.0911 1.0888 1.0874 1.0990 1.0943 1.0962 1.0906 1.0450 1.1041
irintensity: 0.3354 3.5192 0.5466 1.0742 0.9793 8.3843 7.9099 0.5340 1.3518 4.3488 1.2381 0.1855 1.0630 0.5144 1.1078 10.5912 160.2041 12.8542 109.6946 33.8317 1.7890 2.9996 19.1428 21.5082 0.4586 22.8446 2.1077 3.8599 1.9755 1.3291 38.6175 2.5598 5.4348 3.0315 27.3709 4.5502 6.5119 83.9045 3.2886 20.5609 27.2376 2.1601 0.3252 0.3522 3.1199 8.1897 61.5283 6.5774 6.5489 3.2327 13.1419 0.1858 11.0416 4.0390 17.4496 159.3150 30.8947 172.7414 55.5310 94.8777 3.3659 37.1867 17.1125 5.3058 27.4355 15.0337 11.8153 14.5480 89.3102 47.7934 2.9603 121.8142 29.4618 18.2327 19.0754 242.0785 25.1162 248.1949 47.9402 92.0473 46.1574 17.9632 2.5789 28.9061 24.6788 4.2898 6.0818 38.6160 15.5724 8.5406 8.3432 78.0894 21.1838
temp: 298.150 k
press: 1.00000 atm
elementType: 8 7 7 6 6 6 6 6 6 6 6 6 6 6 6 6 6 6 6 1 1 1 1 1 1 1 1 1 1 1 1 1 1
symmnumber: 1
zpe: 676496.3 jmol-1
zpe.correction: 0.257664 hartree
zpe.thermalcorrener: 0.274995 hartree
zpe.thermalcorrenthalpy: 0.275939 hartree
zpe.thermalcorrgfe: 0.211289 hartree
zpe.sumelectzpe: -801.476503 hartree
zpe.sumelectthermal: -801.459172 hartree
zpe.sumelectthermalent: -801.458228 hartree
zpe.sumelectthermalfe: -801.522878 hartree
dipole: 0.1456 -0.8095 0.3840
dipole: 0.9078
quadrupole: -64.4208 -109.1652 -118.3393
quadrupole: -4.2602 -3.4267 1.0695
quadrupole: 32.8876 -11.8567 -21.0309 -4.2602 -3.4267 1.0695
hfenergy: -801.7341672 hartree
pointgroup: C01 [X(C16H14N2O1)]
dipole: -0.072764 0.2360218 -0.2579746 debye
polarizability: 419.4268955|9.8315954|93.1146321|12.959327|-33.2420413|194.1097407 unknown
InChI: InChI=1S/C16H14N2O/c1-19-16-7-5-13(6-8-16)14(11-17)9-12-3-2-4-15(18)10-12/h2-10H,18H2,1H3
charge 0 multiplicity 1
33 atoms
O  5.650816 0.439435 -0.968447
N  -5.304038 -0.844849 1.449603
N  -0.512309 -0.978516 2.607966
C  1.506075 0.023191 -0.10082
C  -2.3989 0.165445 -0.688088
C  0.046174 -0.101364 0.18255
C  -0.934869 0.23363 -0.737984
C  2.010581 0.139339 -1.43094
C  2.451175 0.024488 0.959751
C  -3.157414 -0.330753 0.407611
C  -3.093827 0.638063 -1.846177
C  -4.576944 -0.356928 0.364395
C  4.306497 0.296506 -0.604125
C  3.382601 0.278215 -1.681658
C  3.834907 0.162008 0.724348
C  -4.501285 0.612099 -1.890066
C  -5.248744 0.121806 -0.800993
C  -0.286129 -0.580381 1.500635
C  6.647931 0.453153 0.106288
H  -0.559296 0.638153 -1.687561
H  1.329517 0.093328 -2.28712
H  2.101592 -0.075475 1.993396
H  -2.656578 -0.700786 1.305574
H  -2.523133 1.022822 -2.699234
H  3.76826 0.35919 -2.702378
H  4.52376 0.162225 1.574001
H  -5.025025 0.977103 -2.780583
H  -6.344708 0.106447 -0.844077
H  -4.829941 -1.180676 2.283165
H  -6.318766 -0.874243 1.427536
H  6.640499 -0.498001 0.673058
H  6.47961 1.300579 0.798788
H  7.615509 0.575145 -0.401814
