program: Gaussian 09
title: 000229614
version: EM64L-G09RevD.01
frameworkgroup: C1[X(C18H25NO2S)]
method: RPBEPBE
basis: SDD
operation: Freq
keyword: #p
keyword: freq=noraman
keyword: PBEPBE/SDD
title: #p freq=noraman PBEPBE/SDD
converged: YES YES NO NO
title: Mulliken charges:
elementType: S O O N C C C C C C C C C C C C C C C C C C H H H H H H H H H H H H H H H H H H H H H H H H H
charge: 1.040010 -0.550085 -0.526349 -0.773947 -0.373616 -0.382792 -0.322100 -0.370909 -0.613293 -0.354369 -0.355673 0.586273 -0.695005 -0.635713 0.410804 -0.419813 0.380914 -0.425398 -0.417971 -0.408852 -0.239431 -0.247138 0.201452 0.203594 0.200983 0.201437 0.231160 0.242258 0.191381 0.191754 0.287519 0.285798 0.190501 0.190293 0.195267 0.195240 0.356477 0.210561 0.216575 0.210540 0.238297 0.282449 0.238354 0.236514 0.239916 0.227629 0.228506
chargesum: 0.00000
title: Mulliken charges with hydrogens summed into heavy atoms:
elementType: S O O N C C C C C C C C C C C C C C C C C C
charge: 1.040010 -0.550085 -0.526349 -0.417470 0.031430 0.019627 0.151318 0.012227 -0.039976 0.026425 0.034834 0.586273 -0.057329 -0.397416 0.410804 -0.137365 0.380914 -0.187044 -0.181457 -0.168936 -0.011802 -0.018632
polarizability: 3.25711632e+02 6.02599325e+01 2.47876495e+02 2.85397588e+01 -1.74335405e+01 1.84820107e+02
1716.lowfreq: -5.8635 -4.7155 -0.0018 -0.0012 -0.0009 2.4782 8.7429 15.6476 27.5624
frequency: -3.9590 9.8106 27.4992 34.0483 39.0945 59.6449 82.3497 84.0885 102.3498 104.4012 112.8757 134.9870 145.3381 153.6632 176.0166 184.7874 190.8870 206.0870 230.1684 250.4354 277.8159 288.6136 301.9178 338.8892 372.6621 376.8006 402.9888 420.3285 436.0200 472.7994 477.8536 510.5270 527.2332 532.9092 588.4276 616.7290 651.6595 696.3625 723.4969 733.6975 735.3687 755.4381 756.8834 761.9571 780.2974 787.2892 815.7079 830.0936 846.6465 860.3796 888.1652 897.1894 902.1383 913.8511 945.9177 950.3752 957.6164 979.0048 987.4096 988.9966 1005.1111 1011.5464 1023.1966 1038.0094 1065.1313 1072.8037 1079.5346 1079.6865 1118.4340 1126.4464 1169.4186 1173.5946 1185.4840 1191.7124 1210.2849 1219.6945 1242.1130 1243.6379 1257.1212 1269.3904 1277.8192 1281.2435 1282.4562 1285.5761 1295.7327 1297.6996 1301.0499 1319.5499 1341.9971 1352.4742 1354.8019 1369.7333 1388.9494 1408.5944 1410.9654 1427.9071 1445.7633 1461.8645 1462.4770 1466.2094 1467.3467 1472.3467 1477.3139 1479.1887 1485.8270 1489.2437 1517.1111 1577.5539 1605.0994 1638.7560 2952.5163 2956.2066 2961.1929 2966.9891 2971.1063 2972.5192 2988.4499 2998.7625 2999.7892 3010.6220 3027.7920 3039.9882 3042.3674 3064.9668 3069.3052 3071.6076 3119.2581 3121.2484 3124.2914 3127.1295 3132.3785 3142.5430 3151.8158 3162.4173 3526.4964
redmass: 4.8260 3.9823 1.7281 3.4873 4.4047 3.6176 2.3179 2.7614 7.1144 2.7460 4.9036 1.8615 2.2361 5.1789 4.3106 4.2837 7.0243 6.7706 1.1181 4.4144 3.4666 4.9982 3.8862 2.4818 4.8865 1.7375 3.0526 4.6466 3.9683 2.4742 3.3516 6.5896 4.5748 5.0688 5.2463 6.3833 3.1140 5.2348 1.0632 1.0865 5.3852 1.3018 1.1361 4.8974 2.3602 1.2163 12.8269 1.3119 1.2821 1.5440 1.8956 2.4479 2.7849 1.8819 2.2410 2.9933 1.4083 1.3712 4.8998 1.3494 1.2123 3.6605 2.2399 3.5081 2.8146 2.5434 1.2358 2.2156 2.5809 1.7067 1.1951 1.1207 1.8021 1.3770 1.2542 1.4413 1.2616 1.8862 1.2923 1.4457 1.7780 1.0545 1.2515 1.1907 1.1109 1.5115 1.5007 1.3282 1.4119 1.5319 1.6460 1.5945 1.2162 2.9559 1.3047 3.9364 3.3495 1.0704 1.0744 2.1946 1.1348 1.0778 1.0424 1.0789 1.0880 1.0964 3.6198 7.2259 5.6294 6.8060 1.0587 1.0587 1.0587 1.0590 1.0586 1.0364 1.0973 1.0611 1.0972 1.1023 1.1045 1.0560 1.1047 1.1046 1.1008 1.0993 1.0862 1.0909 1.0891 1.0880 1.1103 1.0947 1.0970 1.1003 1.0778
irintensity: 0.5330 0.1237 0.0274 0.6145 1.6283 1.1376 0.1075 0.2334 2.3847 0.1559 9.0939 0.0784 0.1168 1.6059 0.5204 0.1332 4.8708 1.0832 0.0022 9.9605 15.7698 4.4968 56.3299 22.4729 16.6467 72.2156 3.2256 33.6871 24.6071 24.7637 7.5531 0.0259 20.9174 46.0594 2.9572 2.7231 15.0089 158.4431 13.2386 0.3923 35.0477 34.5587 14.0858 2.4696 1.7811 1.2422 121.8884 28.6918 2.0606 96.1218 5.4270 20.7409 19.0091 28.2700 33.2265 36.1587 7.2884 1.1943 1.0409 0.0498 8.1414 8.0244 3.9204 2.4744 6.3724 0.9868 8.5091 1.4545 28.3995 6.9963 0.3145 7.1726 0.4826 40.1758 13.9514 1.7920 6.7446 28.7552 0.1020 10.9519 11.5527 2.2357 4.8988 3.2031 7.0293 84.4645 101.3818 6.4651 7.5771 0.2307 0.2507 11.3846 11.3499 13.1239 1.0849 0.4617 6.2387 0.0738 0.5037 58.6438 3.5585 0.6588 12.4758 2.3142 0.7039 32.9288 98.5507 1.1559 67.6209 94.6676 0.3103 4.9082 0.2520 6.9595 151.2288 39.8105 0.2604 16.7506 1.4764 1.3124 2.1933 8.1135 98.6939 29.8880 100.3637 52.6307 1.3593 15.9439 1.6163 4.7751 2.4542 33.3384 4.8395 39.7912 56.8262
temp: 298.150 k
press: 1.00000 atm
elementType: 16 8 8 7 6 6 6 6 6 6 6 6 6 6 6 6 6 6 6 6 6 6 1 1 1 1 1 1 1 1 1 1 1 1 1 1 1 1 1 1 1 1 1 1 1 1 1
symmnumber: 1
zpe: 1024863.2 jmol-1
zpe.correction: 0.390350 hartree
zpe.thermalcorrener: 0.413550 hartree
zpe.thermalcorrenthalpy: 0.414494 hartree
zpe.thermalcorrgfe: 0.334544 hartree
zpe.sumelectzpe: -1302.354766 hartree
zpe.sumelectthermal: -1302.331566 hartree
zpe.sumelectthermalent: -1302.330622 hartree
zpe.sumelectthermalfe: -1302.410572 hartree
dipole: 1.1325 -4.1222 -2.6335
dipole: 5.0210
quadrupole: -126.7192 -156.8865 -142.2215
quadrupole: 1.9147 5.6759 -10.8818
quadrupole: 15.2232 -14.9441 -0.2791 1.9147 5.6759 -10.8818
hfenergy: -1302.7451157 hartree
pointgroup: C01 [X(C18H25N1O2S1)]
dipole: 0.508918 1.8454897 0.487276 debye
polarizability: 321.6167711|-69.3821901|235.3346798|-16.3905282|-28.4520412|201.456783 unknown
InChI: InChI=1S/C18H25NO2S/c1-2-3-4-5-6-9-14-22(20,21)19-18-13-12-16-10-7-8-11-17(16)15-18/h7-8,10-13,15,19H,2-6,9,14H2,1H3
charge 0 multiplicity 1
47 atoms
S  -0.120569 -2.58713 0.698682
O  0.135194 -3.743187 1.812424
O  -0.094324 -2.942679 -0.88859
N  -1.710224 -1.883986 1.227442
C  3.372521 -0.132297 0.519684
C  4.7564 -0.353353 -0.133645
C  2.437047 -1.357495 0.342616
C  5.692315 0.866335 0.022138
C  1.08502 -1.091025 0.998421
C  7.079564 0.658107 -0.626617
C  8.01172 1.881909 -0.474005
C  -2.448997 -0.868678 0.574468
C  9.396431 1.668889 -1.12301
C  -3.527252 -0.271266 1.250043
C  -4.289868 0.771735 0.637539
C  -2.1057 -0.430637 -0.753511
C  -3.928378 1.232956 -0.688284
C  -2.827003 0.60061 -1.351575
C  -5.398751 1.393928 1.305462
C  -4.684064 2.289195 -1.293823
C  -6.115121 2.423324 0.690888
C  -5.75743 2.876837 -0.619873
H  2.89715 0.766164 0.075148
H  3.508412 0.08175 1.599545
H  5.237133 -1.246432 0.315833
H  4.621751 -0.579411 -1.211451
H  2.909516 -2.251053 0.793337
H  2.295607 -1.565823 -0.734721
H  5.209516 1.759461 -0.427023
H  5.824312 1.093235 1.100849
H  0.544312 -0.233289 0.56515
H  1.109802 -1.033742 2.098469
H  7.567514 -0.231379 -0.176146
H  6.951032 0.429039 -1.705209
H  8.138999 2.110591 0.603936
H  7.5230 2.770042 -0.924389
H  -2.121205 -2.448581 1.977647
H  9.917948 0.805191 -0.668973
H  10.043134 2.55693 -0.999412
H  9.299948 1.469179 -2.206994
H  -3.787725 -0.595648 2.265209
H  -1.315435 -0.948113 -1.307188
H  -2.563923 0.923025 -2.366158
H  -5.676888 1.049478 2.308843
H  -4.406686 2.630022 -2.298669
H  -6.959342 2.88978 1.210847
H  -6.330515 3.683899 -1.088856
