program: Gaussian 09
title: 000229612
version: EM64L-G09RevD.01
frameworkgroup: C1[X(C16H21NO4S)]
method: RPBEPBE
basis: SDD
operation: Freq
keyword: #p
keyword: freq=noraman
keyword: PBEPBE/SDD
title: #p freq=noraman PBEPBE/SDD
converged: YES YES NO NO
title: Mulliken charges:
elementType: S O O O O N C C C C C C C C C C C C C C C C H H H H H H H H H H H H H H H H H H H H H
charge: 1.029118 -0.490676 -0.492104 -0.165365 -0.223483 -0.512251 -0.331540 -0.379747 -0.380255 -0.581138 -0.372058 -0.353600 -0.356003 0.161860 0.172428 0.189654 0.175801 -0.694960 -0.345110 -0.344267 -0.205812 -0.207508 0.238170 0.238802 0.207316 0.207741 0.292827 0.298402 0.201502 0.201301 0.192648 0.192217 0.190325 0.190526 0.195585 0.195379 0.210603 0.216725 0.210587 0.273220 0.269964 0.241811 0.241365
chargesum: 0.00000
title: Mulliken charges with hydrogens summed into heavy atoms:
elementType: S O O O O N C C C C C C C C C C C C C C C C
charge: 1.029118 -0.490676 -0.492104 -0.165365 -0.223483 -0.512251 0.145432 0.035309 0.022548 0.010091 0.012807 0.027251 0.034960 0.161860 0.172428 0.189654 0.175801 -0.057045 -0.071889 -0.074303 0.036000 0.033856
polarizability: 3.46757213e+02 -1.47769121e+01 2.23335006e+02 2.29120528e-01 3.22487430e-01 1.36419785e+02
1716.lowfreq: -11.3498 -5.5529 -1.4101 -0.0014 0.0011 0.0013 3.5952 14.6568 19.9344
frequency: -7.1301 13.9103 19.8226 32.5628 40.7897 54.5177 69.4454 78.3253 100.9986 103.9979 125.4943 130.3228 133.0428 145.2297 146.4879 170.6557 173.2292 176.3879 223.2927 233.7904 239.9248 281.8196 296.6312 302.6737 328.1824 361.4741 404.4877 426.3131 434.5265 451.1849 484.2212 516.8914 541.3136 572.7995 634.2330 654.5423 675.4048 690.8327 722.4659 731.3060 751.6790 753.3110 779.8728 783.4128 791.5834 825.7257 845.2900 846.2544 889.3326 906.1476 920.5195 961.9728 975.3303 987.0218 1007.1275 1007.8926 1008.1322 1008.8744 1031.0575 1040.2314 1060.8229 1071.6740 1072.9616 1079.5099 1091.5952 1101.7285 1118.4238 1164.9042 1172.9407 1185.0763 1214.0955 1218.8479 1226.2685 1245.5298 1256.1200 1279.1658 1282.7211 1283.2059 1284.4336 1295.4805 1298.8340 1318.7242 1338.9392 1351.6460 1355.3777 1388.3526 1390.8009 1412.7661 1451.7131 1452.6517 1461.6966 1461.9231 1466.6832 1471.9103 1477.9309 1478.9901 1485.4406 1489.3749 1610.9863 1615.8199 1626.7548 1668.7856 2952.7147 2956.2695 2962.5663 2967.7874 2972.4466 2972.7059 2988.2856 2999.1325 3000.1033 3012.4156 3028.4804 3042.6445 3066.5658 3067.3717 3069.1768 3072.0143 3141.5596 3155.2425 3161.5055 3167.1497 3176.4440
redmass: 6.4862 2.9449 4.9470 2.1395 5.9064 3.7214 4.1719 1.7399 2.5233 7.4106 5.5325 1.8940 5.3091 2.5022 6.4950 7.4359 6.8948 5.4068 4.0800 1.1172 6.9262 3.7617 4.5865 8.7497 11.5507 7.4847 3.0743 5.0211 4.0432 4.8958 3.9109 7.5881 9.9755 5.4833 11.0472 4.7830 8.2363 3.6899 1.0624 1.0820 1.1146 6.7961 5.3143 1.2028 1.5057 9.7408 12.0515 1.2581 1.9053 1.3874 1.4223 2.7288 1.4091 5.0522 2.8722 2.3155 1.3544 1.3984 5.8588 4.3988 2.9324 2.8630 2.9363 2.2864 1.2669 4.6139 2.5733 1.9116 1.1389 1.7850 1.2489 1.4283 4.3135 1.2463 1.2872 1.4947 1.0424 1.2488 1.1732 1.0766 1.1147 1.3182 1.3888 1.5087 1.6322 1.1169 1.2161 7.6725 2.4347 2.5917 1.0716 1.0736 1.0696 1.0779 1.0440 1.0773 1.0889 1.0940 7.7227 7.8286 11.6955 12.8666 1.0588 1.0588 1.0589 1.0590 1.0584 1.0364 1.0973 1.0584 1.0997 1.1024 1.1045 1.1048 1.0788 1.0817 1.1007 1.0993 1.0866 1.0907 1.1109 1.0957 1.1004
irintensity: 1.4721 0.3020 1.3654 1.2351 0.3739 2.0575 0.5901 0.4097 0.1541 2.9440 12.7824 0.3026 0.5638 0.3857 1.9751 1.7936 0.0074 1.1531 0.2426 0.0130 1.4078 15.5734 44.5285 4.8117 5.5057 26.7902 1.1827 94.8587 32.1597 0.0002 28.9125 8.7531 38.8551 1.9875 0.4077 0.1511 2.7017 68.1427 14.4196 0.3388 4.7022 18.6700 0.2546 0.6842 43.9672 45.3909 27.0292 0.0094 7.7946 0.0395 15.2517 47.4765 2.0841 3.3652 33.7352 7.9320 0.0687 13.6667 94.5733 41.1757 19.9608 0.8436 3.4370 2.7288 11.7366 196.7376 25.7376 1.3752 51.2313 0.6985 20.3788 3.1062 351.9648 3.6065 0.1446 0.3907 1.2685 5.3039 0.1723 0.0208 0.0834 9.3561 8.4697 1.1391 0.2066 15.6321 10.7769 8.0738 12.5643 0.5773 0.1455 1.0371 3.3433 0.4632 12.0559 3.1316 2.2925 31.2596 72.2638 4.2164 364.7715 40.6125 0.2483 4.4931 1.5326 38.9932 108.6492 46.9311 0.1165 17.9439 0.1045 0.7262 4.8830 98.4219 14.9921 14.1194 107.7331 53.1196 1.8482 4.4977 0.4596 4.2904 25.0490
temp: 298.150 k
press: 1.00000 atm
elementType: 16 8 8 8 8 7 6 6 6 6 6 6 6 6 6 6 6 6 6 6 6 6 1 1 1 1 1 1 1 1 1 1 1 1 1 1 1 1 1 1 1 1 1
symmnumber: 1
zpe: 895754.7 jmol-1
zpe.correction: 0.341175 hartree
zpe.thermalcorrener: 0.364416 hartree
zpe.thermalcorrenthalpy: 0.365360 hartree
zpe.thermalcorrgfe: 0.284901 hartree
zpe.sumelectzpe: -1374.202379 hartree
zpe.sumelectthermal: -1374.179138 hartree
zpe.sumelectthermalent: -1374.178194 hartree
zpe.sumelectthermalfe: -1374.258654 hartree
dipole: -0.2308 6.0183 -0.1158
dipole: 6.0238
quadrupole: -95.1961 -154.4650 -144.9381
quadrupole: -18.5094 -0.1340 0.1078
quadrupole: 36.3370 -22.9319 -13.4051 -18.5094 -0.1340 0.1078
hfenergy: -1374.5435542 hartree
pointgroup: C01 [X(C16H21N1O4S1)]
dipole: -0.1585985 2.1229634 -1.0414368 debye
polarizability: 347.4270926|-11.7915978|207.519708|1.3577809|-32.7313243|151.5652029 unknown
InChI: InChI=1S/C16H21NO4S/c1-2-3-4-5-6-9-12-22(20,21)17-15(18)13-10-7-8-11-14(13)16(17)19/h7-8,10-11H,2-6,9,12H2,1H3
charge 0 multiplicity 1
43 atoms
S  -0.408957 -1.338398 0.842676
O  -0.352717 -2.676308 -0.060548
O  -0.286991 -1.424548 2.451055
O  -3.471115 -2.207313 1.287403
O  -1.409655 1.660378 -0.527307
N  -2.103109 -0.429638 0.436013
C  2.307094 -0.639805 0.457856
C  3.389841 0.331869 -0.086822
C  4.820562 -0.178685 0.20171
C  0.920293 -0.070838 0.17163
C  5.914155 0.767531 -0.343136
C  7.348024 0.272912 -0.04707
C  8.442778 1.216372 -0.595994
C  -3.348935 -1.081976 0.762373
C  -2.301429 0.86098 -0.148063
C  -4.412207 -0.112836 0.335469
C  -3.790527 1.038301 -0.203416
C  9.872737 0.719801 -0.29231
C  -5.808825 -0.223573 0.412726
C  -4.541334 2.121835 -0.685189
C  -6.578424 0.866027 -0.071508
C  -5.954759 2.020119 -0.611613
H  2.423475 -1.629102 -0.023727
H  2.445979 -0.776483 1.546825
H  3.2573 1.333232 0.37075
H  3.257706 0.46112 -1.18012
H  0.661903 0.015818 -0.894469
H  0.675567 0.858354 0.706882
H  4.949566 -1.185845 -0.245281
H  4.952828 -0.302057 1.296254
H  5.786367 0.884311 -1.439647
H  5.778045 1.778066 0.095899
H  7.479832 0.160126 1.049425
H  7.486636 -0.738937 -0.482239
H  8.312865 1.326114 -1.692143
H  8.301471 2.228112 -0.163614
H  10.049392 -0.277385 -0.738102
H  10.635866 1.410206 -0.696187
H  10.039082 0.63277 0.798085
H  -6.277781 -1.118903 0.832145
H  -4.048691 3.006931 -1.09917
H  -7.671691 0.817861 -0.028395
H  -6.576221 2.844682 -0.976707
