program: Gaussian 09
title: 000229590
version: EM64L-G09RevD.01
frameworkgroup: C1[X(C15H32O6S2)]
method: RPBEPBE
basis: SDD
operation: Freq
keyword: #p
keyword: freq=noraman
keyword: PBEPBE/SDD
title: #p freq=noraman PBEPBE/SDD
converged: YES YES NO NO
title: Mulliken charges:
elementType: S S O O O O O O C C C C C C C C C C C C C C C H H H H H H H H H H H H H H H H H H H H H H H H H H H H H H H H
charge: 1.023308 1.023259 -0.421004 -0.420989 -0.571859 -0.507873 -0.571857 -0.507883 0.261190 0.286317 0.286370 -0.302543 -0.302527 -0.661831 -0.661800 -0.711732 -0.711737 -0.705042 -0.695254 -0.686262 -0.705046 -0.695288 -0.686268 0.213915 0.255186 0.213925 0.255136 0.284143 0.369124 0.284095 0.369176 0.217932 0.210816 0.240587 0.217925 0.210824 0.240590 0.215461 0.226257 0.238874 0.210582 0.204889 0.261692 0.222145 0.216514 0.235062 0.238893 0.226241 0.215468 0.261703 0.204892 0.210602 0.235030 0.216524 0.222151
chargesum: 0.00000
title: Mulliken charges with hydrogens summed into heavy atoms:
elementType: S S O O O O O O C C C C C C C C C C C C C C C
charge: 1.023308 1.023259 -0.421004 -0.420989 -0.571859 -0.507873 -0.571857 -0.507883 0.261190 0.286317 0.286370 0.166559 0.166534 -0.008565 -0.008529 -0.042397 -0.042399 -0.024451 -0.018090 -0.012542 -0.024444 -0.018091 -0.012564
polarizability: 2.61604097e+02 -2.60784204e-02 2.77186325e+02 -3.15428950e+00 1.31964593e-03 2.06747334e+02
1716.lowfreq: -15.2070 -14.9348 -1.3917 0.0007 0.0016 0.0017 21.6369 22.4793 37.3998
frequency: 21.4839 21.7721 37.0300 39.5587 43.0137 43.3781 76.1599 77.3258 91.8968 104.2701 112.5388 128.5842 135.4471 143.3569 151.6401 169.6787 172.9052 178.1796 183.9684 192.9844 201.2920 201.8027 207.8585 211.0061 227.6924 227.7688 253.5790 260.9751 265.0365 267.5635 269.4376 271.2296 312.9788 328.2860 329.1512 334.6555 342.7416 348.3143 361.7649 371.0407 383.7155 406.8842 407.1230 418.6858 424.1316 424.2701 434.4437 489.0760 489.3389 554.1638 573.5323 595.6795 597.0588 735.8034 735.9942 765.2783 827.0687 827.5527 870.4348 872.3888 897.0098 900.4376 901.8885 903.7136 915.8809 916.1830 922.3295 932.0111 932.7451 935.6955 936.0717 939.6951 942.9381 943.5017 953.6042 954.2673 996.6543 1019.2337 1020.7326 1037.2609 1045.8679 1046.5382 1144.0215 1148.2714 1166.1755 1180.2292 1198.8018 1199.7763 1215.5480 1257.9117 1260.7064 1269.6007 1274.4491 1275.7719 1276.5756 1296.9246 1299.6698 1345.5710 1349.3239 1373.9041 1374.0573 1374.1810 1384.7137 1385.2136 1395.1564 1400.4672 1402.0951 1421.3500 1422.8148 1453.0384 1455.7133 1456.1244 1457.3178 1461.6913 1462.6887 1462.7199 1467.6113 1468.6047 1468.7363 1475.1482 1481.4004 1481.8184 1483.9907 1485.3391 1487.2579 1498.3359 1499.5455 2973.6597 2974.0655 2975.1305 2975.1611 2977.5563 2977.6338 2977.8602 2981.3411 2981.4809 2981.8698 2991.9941 2994.6446 3042.5107 3046.0115 3069.3342 3071.1642 3071.2770 3075.4162 3075.5135 3075.5534 3077.5320 3078.3913 3081.6767 3081.7433 3084.7366 3085.9263 3086.2446 3088.9425 3091.0747 3091.1630 3108.1517 3108.2264
redmass: 3.0764 3.5662 4.6872 3.1805 3.8876 4.2309 5.5458 9.1826 3.7323 3.4474 2.1003 3.7200 4.1017 1.6733 3.5954 1.6358 4.0566 4.2800 4.7992 2.3332 1.3881 2.1284 1.5714 1.9116 2.8428 2.9011 4.0873 1.3153 1.1728 1.0971 1.1186 2.9248 2.3751 2.3930 2.1442 3.0838 5.7085 3.6041 3.0917 3.2749 3.0757 1.9958 2.0417 3.3634 2.6262 4.5166 2.3397 4.7276 3.9639 6.8759 7.4830 5.5319 5.6043 3.7274 3.7227 3.7266 9.8201 12.8581 1.9126 1.9554 2.1882 2.2659 2.2571 2.3787 4.5171 2.5468 1.5174 1.9550 2.0589 1.8011 1.7246 1.8703 2.5309 2.5121 1.2106 1.2124 1.5221 1.4375 1.4491 1.4967 1.4223 1.4242 1.2656 1.2944 1.7885 1.4876 2.3553 2.3600 2.2461 2.9335 2.9562 1.4360 1.9215 1.8460 1.8806 1.3043 1.2793 1.2874 1.3164 1.1761 1.1985 1.1760 1.1924 1.1913 1.2061 1.1412 1.1518 1.1510 1.1362 1.0617 1.0737 1.0475 1.0482 1.0499 1.0489 1.0484 1.0634 1.0484 1.0487 1.0561 1.0547 1.0527 1.0598 1.0543 1.0531 1.0615 1.0618 1.0540 1.0524 1.0344 1.0342 1.0354 1.0363 1.0354 1.0382 1.0362 1.0366 1.0618 1.0615 1.1075 1.1088 1.1001 1.0999 1.0999 1.0998 1.0998 1.0988 1.1000 1.0997 1.1005 1.1005 1.0998 1.0994 1.1000 1.0993 1.0999 1.0999 1.1062 1.1061
irintensity: 0.2300 0.5977 0.7802 0.2123 4.1457 0.0718 4.2836 0.5147 1.1007 2.5913 0.2281 1.3244 7.9063 1.7274 3.0385 0.9546 11.4476 1.6082 6.8377 1.7962 0.7568 4.2496 0.8082 5.1847 3.8857 5.9501 2.5289 5.2220 0.3444 1.1491 2.5246 8.0413 0.0477 5.2200 0.0186 11.3224 19.3199 0.4739 0.6467 0.0987 6.4876 1.2305 0.5645 10.7770 42.5010 24.9014 5.7140 49.7431 14.2988 24.3857 161.1932 5.6770 0.6285 0.5505 0.7068 3.7107 40.4649 56.9083 31.1702 19.4848 1.0208 11.7527 14.0067 30.2936 74.4637 36.7577 19.0076 58.1958 0.4671 23.7967 4.8114 19.2076 125.0984 1.6822 0.6776 0.1908 41.1829 0.8854 2.2785 11.0916 10.1105 1.3545 31.7443 0.4889 0.3183 10.2220 10.4399 0.2589 1.7930 22.5301 34.8876 3.5072 24.8010 1.2025 1.9768 7.9854 1.2797 2.0454 0.0510 38.0143 20.3670 0.1523 6.8187 43.2630 31.5224 18.2757 28.4067 2.4869 0.4178 3.1581 5.4503 3.7588 0.3885 0.0689 2.5939 2.8271 13.9888 2.4107 2.2838 8.3208 0.3508 23.5383 23.4259 26.9504 1.1287 49.0519 13.5205 31.7063 14.7079 3.6298 35.1334 51.7366 43.7768 1.0951 87.2165 6.8524 3.0616 0.2179 101.8419 9.9065 27.3484 0.6691 0.0686 7.0407 27.5240 26.5265 62.7904 15.7436 31.8081 5.1414 21.8785 88.3180 36.0086 19.6761 42.6264 27.6593 27.1942 21.3545 7.0839
temp: 298.150 k
press: 1.00000 atm
elementType: 16 16 8 8 8 8 8 8 6 6 6 6 6 6 6 6 6 6 6 6 6 6 6 1 1 1 1 1 1 1 1 1 1 1 1 1 1 1 1 1 1 1 1 1 1 1 1 1 1 1 1 1 1 1 1
symmnumber: 1
zpe: 1193272.5 jmol-1
zpe.correction: 0.454493 hartree
zpe.thermalcorrener: 0.486089 hartree
zpe.thermalcorrenthalpy: 0.487033 hartree
zpe.thermalcorrgfe: 0.391869 hartree
zpe.sumelectzpe: -1836.032045 hartree
zpe.sumelectthermal: -1836.000449 hartree
zpe.sumelectthermalent: -1835.999505 hartree
zpe.sumelectthermalfe: -1836.094670 hartree
dipole: 0.0024 -1.1202 0.0010
dipole: 1.1202
quadrupole: -165.6858 -139.8337 -169.5871
quadrupole: -0.0348 -23.2416 -0.0236
quadrupole: -7.3169 18.5352 -11.2182 -0.0348 -23.2416 -0.0236
hfenergy: -1836.4865388 hartree
pointgroup: C01 [X(C15H32O6S2)]
dipole: -0.0002372 0.4407327 0.0012928 debye
polarizability: 261.2229802|0.0060663|277.1861164|-5.5415467|0.132752|207.128659 unknown
InChI: InChI=1S/C15H32O6S2/c1-13(2,3)11-22(16,17)20-9-15(7,8)10-21-23(18,19)12-14(4,5)6/h9-12H2,1-8H3
charge 0 multiplicity 1
55 atoms
S  1.871451 -0.122777 -1.311745
S  -1.866041 -0.126067 1.308114
O  1.711321 -1.869747 -0.603503
O  -1.706193 -1.870149 0.592633
O  0.374552 0.375427 -1.730201
O  3.012355 -0.088355 -2.456353
O  -0.369087 0.370047 1.728821
O  -3.007051 -0.096333 2.452754
C  0.001834 -3.534916 -0.007956
C  3.098516 2.032681 0.254332
C  -3.092199 2.03646 -0.248887
C  0.577823 -2.648322 -1.143822
C  -0.573442 -2.651364 1.130665
C  2.443661 0.646385 0.382814
C  -2.437663 0.650575 -0.383338
C  -1.114548 -4.419157 -0.621332
C  1.11744 -4.422082 0.602572
C  2.211304 3.013639 -0.555603
C  4.515402 1.938858 -0.369116
C  3.207797 2.536951 1.729299
C  -2.205058 3.013572 0.565753
C  -4.509285 1.940116 0.373752
C  -3.201026 2.547427 -1.721567
H  0.942762 -3.280966 -1.975155
H  -0.206535 -1.957512 -1.512765
H  -0.93897 -3.286273 1.960008
H  0.211451 -1.962365 1.501857
H  3.128076 -0.136301 0.75132
H  1.482531 0.636026 0.929918
H  -3.122226 -0.130293 -0.755425
H  -1.476361 0.642163 -0.930176
H  -1.535399 -5.090126 0.150283
H  -0.714695 -5.049411 -1.437128
H  -1.939609 -3.803041 -1.019415
H  1.537406 -5.091209 -0.171116
H  0.717168 -5.054329 1.416612
H  1.94321 -3.807935 1.002195
H  2.630039 4.033773 -0.488564
H  1.17791 3.036566 -0.1644
H  2.169855 2.73615 -1.624741
H  4.974629 2.943265 -0.407217
H  5.173258 1.286999 0.236362
H  4.478574 1.53208 -1.39466
H  3.718979 3.516996 1.737202
H  3.798134 1.842713 2.35562
H  2.210655 2.659505 2.189483
H  -2.164064 2.731248 1.633639
H  -1.171517 3.038045 0.175054
H  -2.623535 4.034095 0.503183
H  -4.472858 1.528163 1.397247
H  -5.167286 1.291614 -0.235157
H  -4.968081 2.944507 0.416853
H  -2.203776 2.67209 -2.180936
H  -3.791212 1.856065 -2.351199
H  -3.712176 3.527522 -1.72517
