program: Gaussian 09
title: 000229588
version: EM64L-G09RevD.01
frameworkgroup: C1[X(C10H22O3S)]
method: RPBEPBE
basis: SDD
operation: Freq
keyword: #p
keyword: freq=noraman
keyword: PBEPBE/SDD
title: #p freq=noraman PBEPBE/SDD
converged: YES YES NO NO
title: Mulliken charges:
elementType: S O O O C C C C C C C C C C H H H H H H H H H H H H H H H H H H H H H H
charge: 1.029833 -0.410988 -0.521540 -0.532016 -0.379599 -0.374798 -0.371887 -0.326188 -0.353553 -0.612989 -0.356076 -0.694861 -0.223949 -0.656045 0.199919 0.201599 0.203107 0.203225 0.191342 0.192061 0.230727 0.241316 0.190075 0.190578 0.289506 0.285443 0.195453 0.195157 0.210638 0.216570 0.210455 0.236422 0.221753 0.215704 0.230186 0.233419
chargesum: 0.00000
title: Mulliken charges with hydrogens summed into heavy atoms:
elementType: S O O O C C C C C C C C C C
charge: 1.029833 -0.410988 -0.521540 -0.532016 0.021919 0.031534 0.011516 0.145854 0.027101 -0.038040 0.034534 -0.057197 0.234226 0.023264
polarizability: 2.12480433e+02 -8.51877277e+00 1.30068980e+02 -1.58034667e+00 8.75901289e-01 1.21282770e+02
1716.lowfreq: -0.0028 -0.0027 0.0020 3.7464 8.4050 18.1138 24.2919 28.5017 41.4352
frequency: 23.9761 28.3775 41.3193 48.3870 54.0851 64.2431 79.8577 93.2630 103.7046 127.8296 143.3967 148.0325 161.2515 196.0991 211.0742 224.2145 241.3590 250.5640 284.3417 299.9198 316.1367 363.6217 427.0584 455.3118 492.0253 564.0666 609.5267 725.2788 734.0524 756.1830 788.9221 822.6508 834.7173 844.0870 851.6212 888.1991 918.5432 953.1197 988.2718 1009.8725 1012.7362 1013.5313 1038.6602 1065.9418 1073.2050 1080.0926 1090.1406 1099.6766 1119.3202 1139.4806 1185.7662 1215.7689 1219.0887 1245.3488 1252.8211 1257.6778 1283.2959 1284.8244 1288.4669 1298.7206 1304.2536 1321.5113 1346.0399 1354.0818 1354.6351 1356.7039 1388.8227 1390.3617 1414.0997 1456.7214 1463.8021 1464.1110 1468.9326 1473.7963 1476.0173 1479.5739 1480.4116 1487.0344 1490.7190 1492.6860 2953.6421 2957.2314 2962.4771 2968.2696 2972.4823 2972.9465 2986.0616 2989.6319 2994.3427 2997.4533 3000.6106 3011.6359 3028.3361 3042.8600 3050.6164 3052.1036 3063.7865 3069.4719 3072.3129 3090.7723 3109.4398 3143.2327
redmass: 3.7866 4.1162 4.3510 2.9712 1.8785 1.8538 4.2259 1.8666 2.2406 5.1025 1.8774 2.1371 4.1363 4.8163 3.4979 1.1394 1.2674 4.2677 3.6927 5.2602 4.1571 6.7245 3.4026 4.1195 4.4653 7.3868 6.0036 1.0626 1.0827 1.1068 1.1986 1.1276 3.7284 4.4057 1.4161 1.8950 1.7323 2.1554 4.8012 1.2221 3.2216 3.1842 3.4724 2.8798 2.5818 2.2372 1.3216 2.0016 2.6459 1.4276 1.7899 1.2401 1.4514 1.2518 1.1441 1.2853 1.2850 1.0299 1.1636 1.0801 1.1060 1.3355 1.4087 1.5374 1.2612 1.6309 1.2165 1.2194 1.1044 1.0406 1.0704 1.0720 1.0696 1.0739 1.0424 1.0462 1.0792 1.0904 1.0973 1.0827 1.0588 1.0589 1.0589 1.0592 1.0587 1.0365 1.0535 1.0972 1.0376 1.0595 1.0992 1.1023 1.1044 1.1047 1.1088 1.0560 1.1047 1.1007 1.0993 1.0979 1.1022 1.1103
irintensity: 0.2222 1.3361 1.6382 0.2110 0.7099 2.2827 1.4325 0.2691 0.1519 10.9030 0.0617 0.0217 1.3796 6.3921 1.1495 0.0040 0.0906 0.4903 1.6381 12.9900 15.1676 20.8227 1.9906 30.6574 14.1213 113.0398 1.1814 13.6739 0.4850 5.4951 0.5756 6.8638 67.2124 49.9252 8.1678 5.4162 32.2029 40.9512 1.0855 9.4356 46.6184 22.6839 0.2258 3.2961 0.3007 1.5475 17.1675 58.6527 13.5344 4.7995 0.7198 9.8852 0.3664 6.8371 1.9732 0.2361 6.7449 0.7598 0.3056 0.0295 0.2109 5.9371 9.0038 0.1476 9.1621 0.4128 11.3105 16.0638 6.0864 13.0329 0.0028 0.4511 2.2976 0.2934 12.6235 8.7077 2.3776 0.3642 31.5206 19.5499 0.2394 4.5074 0.1517 7.9271 140.6867 51.2522 35.4333 0.1950 34.0666 17.9474 0.4977 1.1114 2.0576 93.9843 13.5027 5.6454 38.7287 103.4029 53.5798 27.0180 35.0107 1.9254
temp: 298.150 k
press: 1.00000 atm
elementType: 16 8 8 8 6 6 6 6 6 6 6 6 6 6 1 1 1 1 1 1 1 1 1 1 1 1 1 1 1 1 1 1 1 1 1 1
symmnumber: 1
zpe: 809795.0 jmol-1
zpe.correction: 0.308435 hartree
zpe.thermalcorrener: 0.327985 hartree
zpe.thermalcorrenthalpy: 0.328929 hartree
zpe.thermalcorrgfe: 0.257258 hartree
zpe.sumelectzpe: -1016.646856 hartree
zpe.sumelectthermal: -1016.627306 hartree
zpe.sumelectthermalent: -1016.626362 hartree
zpe.sumelectthermalfe: -1016.698033 hartree
dipole: 1.9470 3.5968 0.3246
dipole: 4.1028
quadrupole: -86.1464 -102.8631 -101.1375
quadrupole: -10.5666 -0.1893 0.1718
quadrupole: 10.5693 -6.1474 -4.4218 -10.5666 -0.1893 0.1718
hfenergy: -1016.9552909 hartree
pointgroup: C01 [X(C10H22O3S1)]
dipole: -0.7570893 1.4154923 -0.1694829 debye
polarizability: 212.5888773|7.98596|129.91603|-1.5244061|-1.08176|121.3272749 unknown
InChI: InChI=1S/C10H22O3S/c1-3-5-6-7-8-9-10-14(11,12)13-4-2/h3-10H2,1-2H3
charge 0 multiplicity 1
36 atoms
S  2.932006 -0.77448 0.05195
O  4.130948 0.641461 0.327986
O  2.821699 -1.707052 1.371655
O  3.267644 -1.465164 -1.379027
C  -2.457384 -0.324821 0.006681
C  -1.137089 0.478385 -0.044545
C  -3.711864 0.577063 -0.020993
C  0.107269 -0.446457 -0.002655
C  -5.034689 -0.221202 0.018844
C  1.390747 0.378563 -0.0740
C  -6.290836 0.679585 -0.006306
C  -7.608461 -0.124406 0.031426
C  5.545009 0.281497 0.041145
C  6.30557 1.610606 0.025009
H  -2.491771 -1.028421 -0.85045
H  -2.472351 -0.948486 0.924073
H  -1.117313 1.092443 -0.968055
H  -1.103875 1.186013 0.808988
H  -3.692465 1.206713 -0.935137
H  -3.681089 1.27692 0.840177
H  0.066324 -1.158856 -0.848922
H  0.09634 -1.040644 0.930747
H  -5.069036 -0.919721 -0.843257
H  -5.056342 -0.852958 0.931378
H  1.532533 1.063927 0.776933
H  1.554436 0.89601 -1.032201
H  -6.256506 1.376513 0.855952
H  -6.267466 1.311504 -0.917696
H  -7.670706 -0.740419 0.948385
H  -8.490622 0.541587 0.011414
H  -7.680866 -0.807487 -0.835951
H  5.603238 -0.232011 -0.937986
H  5.923223 -0.390974 0.834269
H  7.378035 1.41851 -0.164722
H  5.921962 2.273144 -0.769218
H  6.210348 2.129314 0.993909
