program: Gaussian 09
title: 000229586
version: EM64L-G09RevD.01
frameworkgroup: C1[X(C8H18O3S)]
method: RPBEPBE
basis: SDD
operation: Freq
keyword: #p
keyword: freq=noraman
keyword: PBEPBE/SDD
title: #p freq=noraman PBEPBE/SDD
converged: YES YES NO NO
title: Mulliken charges:
elementType: S O O O C C C C C C C C H H H H H H H H H H H H H H H H H H
charge: 1.021428 -0.410966 -0.520430 -0.529045 0.010143 -0.028795 -0.665638 -0.732990 -0.727756 -0.720106 -0.224311 -0.656541 0.248471 0.200849 0.288332 0.298938 0.215889 0.247988 0.228556 0.222682 0.219884 0.222120 0.214737 0.217933 0.221162 0.221457 0.237102 0.215626 0.230194 0.233087
chargesum: 0.00000
title: Mulliken charges with hydrogens summed into heavy atoms:
elementType: S O O O C C C C C C C C
charge: 1.021428 -0.410966 -0.520430 -0.529045 0.258614 0.172054 -0.078367 -0.040556 -0.063070 -0.066275 0.234248 0.022367
polarizability: 1.67125842e+02 -5.42597124e+00 1.14619362e+02 -3.09705132e+00 5.13850356e-01 1.06931262e+02
1716.lowfreq: -18.7711 -0.0011 -0.0009 -0.0008 5.4345 11.4309 18.7133 35.3341 52.2021
frequency: 7.5056 35.1516 52.0394 60.5000 66.2387 83.3872 143.8693 171.5876 182.6993 200.0312 211.0108 231.6516 237.3175 241.4481 253.1996 282.6238 298.4061 314.3325 360.7764 382.1302 451.2792 465.5332 534.9180 560.3712 607.7004 758.7785 822.5758 833.7739 837.8331 849.1103 885.0626 918.6636 929.0401 940.8290 959.5271 1012.7372 1023.3702 1034.3221 1090.8796 1098.8306 1120.7656 1139.4298 1161.4902 1180.0783 1198.9346 1238.2619 1251.7962 1287.9074 1311.8084 1343.7488 1353.1149 1364.0744 1382.5177 1390.0888 1392.6839 1402.6583 1411.0273 1456.6915 1466.4975 1468.5285 1476.3344 1479.8522 1486.8171 1488.3901 1490.9080 1492.9380 2954.5467 2976.7188 2978.6202 2983.1973 2985.5554 2990.9256 2994.2018 3043.7098 3050.1112 3068.8937 3071.9949 3075.2075 3077.4282 3082.1000 3090.6561 3094.2523 3109.5795 3137.2869
redmass: 3.2506 4.2620 3.2673 2.9940 1.9979 3.1634 4.0284 1.1887 4.0193 2.8631 2.9634 1.3075 1.0926 1.3036 4.0889 2.5502 4.9673 2.5114 4.4229 2.9422 2.5337 5.5918 2.5670 6.1431 5.1623 2.8482 1.1411 3.3384 2.6946 3.1899 1.8419 1.2024 1.8222 3.7934 1.4090 2.8347 1.5795 1.9205 1.4290 2.0691 2.0456 1.4243 2.1972 1.7410 1.8192 1.2147 1.1433 1.3389 1.2958 1.3719 1.2607 1.3997 1.2059 1.2189 1.1993 1.1858 1.1312 1.0406 1.0475 1.0471 1.0488 1.0461 1.0478 1.0454 1.0540 1.0825 1.0830 1.0359 1.0411 1.0776 1.0538 1.0366 1.0374 1.0562 1.1088 1.0992 1.0998 1.0993 1.0992 1.0988 1.0979 1.0988 1.1022 1.1100
irintensity: 0.8098 0.9655 0.3564 0.7187 2.2005 2.9994 12.0280 0.8014 5.4247 1.6646 1.6701 0.5833 0.0644 0.2146 1.2135 0.3123 10.3866 1.6040 19.2574 8.7276 10.1149 51.2874 7.4166 106.1897 1.1462 10.2523 7.5026 62.5022 19.1597 30.4640 16.0014 0.5104 2.1376 60.5042 1.6168 58.4435 17.0610 22.2929 12.8400 49.4848 5.9290 5.0519 15.3727 3.6536 4.9266 2.9942 2.1394 17.5446 0.4950 4.5493 8.3424 0.3185 21.9924 15.4826 14.7271 24.0599 6.3036 13.0329 2.1450 11.8861 7.7630 8.6237 13.1949 18.4069 6.9950 17.4690 25.9352 36.4082 14.8783 9.1928 33.9949 15.9520 31.6589 2.0474 13.6471 33.3703 4.3286 50.3059 47.8284 42.6685 26.8436 29.4026 34.7261 1.2931
temp: 298.150 k
press: 1.00000 atm
elementType: 16 8 8 8 6 6 6 6 6 6 6 6 1 1 1 1 1 1 1 1 1 1 1 1 1 1 1 1 1 1
symmnumber: 1
zpe: 660538.2 jmol-1
zpe.correction: 0.251586 hartree
zpe.thermalcorrener: 0.268396 hartree
zpe.thermalcorrenthalpy: 0.269341 hartree
zpe.thermalcorrgfe: 0.204754 hartree
zpe.sumelectzpe: -938.202089 hartree
zpe.sumelectthermal: -938.185279 hartree
zpe.sumelectthermalent: -938.184334 hartree
zpe.sumelectthermalfe: -938.248921 hartree
dipole: 1.6644 3.5908 0.3987
dipole: 3.9779
quadrupole: -68.0391 -88.9339 -88.6890
quadrupole: -3.8266 0.0817 -0.1585
quadrupole: 13.8483 -7.0466 -6.8017 -3.8266 0.0817 -0.1585
hfenergy: -938.453675 hartree
pointgroup: C01 [X(C8H18O3S1)]
dipole: -0.6442608 -1.4204841 0.1280594 debye
polarizability: 167.2674794|-5.1910628|114.576303|2.0241122|-0.2053783|106.8326835 unknown
InChI: InChI=1S/C8H18O3S/c1-5-11-12(9,10)6-8(4)7(2)3/h7-8H,5-6H2,1-4H3
charge 0 multiplicity 1
30 atoms
S  1.125325 0.780305 -0.043743
O  2.361829 -0.594617 -0.368386
O  0.934864 1.705703 -1.359644
O  1.515035 1.492456 1.363123
C  -1.688028 0.296793 -0.136644
C  -2.821228 -0.767515 -0.370749
C  -0.370817 -0.436764 0.139399
C  -2.005327 1.331069 0.968893
C  -3.141428 -1.620551 0.881432
C  -4.103886 -0.094548 -0.915629
C  3.771208 -0.184695 -0.130266
C  4.580585 -1.484652 -0.151832
H  -1.569016 0.838369 -1.098621
H  -2.449563 -1.453932 -1.162476
H  -0.242299 -0.807194 1.168694
H  -0.124594 -1.213929 -0.602659
H  -2.093835 0.850295 1.960055
H  -1.210033 2.09446 1.042282
H  -2.949712 1.859383 0.755176
H  -3.544988 -0.996232 1.69953
H  -3.905356 -2.381282 0.638096
H  -2.252825 -2.155084 1.265442
H  -4.570133 0.561396 -0.158031
H  -4.850174 -0.861221 -1.194247
H  -3.891362 0.515521 -1.81303
H  4.095259 0.50655 -0.931272
H  3.845627 0.324493 0.850017
H  5.650892 -1.253657 0.003766
H  4.249028 -2.16695 0.64901
H  4.472253 -1.999065 -1.121589
