program: Gaussian 09
title: 000229580
version: EM64L-G09RevD.01
frameworkgroup: C1[X(C16H14Cl2N2O2S2)]
method: RPBEPBE
basis: SDD
operation: Freq
keyword: #p
keyword: freq=noraman
keyword: PBEPBE/SDD
title: #p freq=noraman PBEPBE/SDD
converged: YES YES NO NO
title: Mulliken charges:
elementType: Cl Cl S S O O N N C C C C C C C C C C C C C C C C H H H H H H H H H H H H H H
charge: -0.045317 -0.052499 0.071125 0.029408 -0.414322 -0.412291 -0.089442 -0.084121 0.352415 0.357611 0.192641 0.172907 -0.827234 -0.814369 -0.356133 -0.346721 -0.351258 -0.341728 -0.242846 -0.221112 -0.211424 -0.220325 -0.111601 -0.120118 0.317862 0.284001 0.340521 0.285385 0.247472 0.274480 0.279115 0.254324 0.266696 0.256515 0.258923 0.264387 0.378671 0.378400
chargesum: 0.00000
title: Mulliken charges with hydrogens summed into heavy atoms:
elementType: Cl Cl S S O O N N C C C C C C C C C C C C C C C C
charge: -0.045317 -0.052499 0.071125 0.029408 -0.035651 -0.033891 -0.089442 -0.084121 0.352415 0.357611 0.192641 0.172907 -0.225371 -0.188462 -0.108662 -0.072241 -0.072143 -0.087405 0.023850 0.035403 0.047499 0.044063 -0.111601 -0.120118
polarizability: 3.75441189e+02 -5.31061815e+01 2.66999807e+02 -2.03585521e+01 5.87318002e+00 1.62048194e+02
1716.lowfreq: -16.0639 -8.3040 0.0018 0.0020 0.0024 1.8888 4.0087 8.9696 20.1612
frequency: -14.1872 7.8775 20.0993 21.2536 34.7060 44.2791 54.6412 66.9656 77.7230 104.5943 120.7946 140.9945 145.0902 160.1817 190.4195 214.7612 226.9116 267.8232 269.6282 293.7283 299.3800 315.7549 323.6377 357.3693 364.7803 403.9967 407.9055 410.8954 418.3710 423.7193 449.9544 457.3439 479.3443 482.5875 493.7112 496.9257 547.2061 548.4311 624.5675 625.3293 666.6295 669.2272 688.2612 699.5532 723.9165 734.4847 769.2387 770.3853 819.8987 832.1866 845.8688 846.7576 871.2886 882.5765 904.1055 917.6483 948.2527 959.3483 982.4489 984.5516 995.5200 997.2097 1043.9773 1047.5221 1075.7505 1076.7127 1116.1071 1116.9335 1128.0526 1154.3123 1192.8165 1193.8989 1235.6713 1239.1325 1247.6786 1248.3987 1298.7047 1301.6429 1353.2379 1355.4958 1358.4529 1361.9620 1397.1277 1398.8091 1436.6833 1451.4383 1484.9642 1486.2481 1538.5182 1539.6314 1580.1643 1582.3661 1597.7900 1598.3696 3041.5877 3063.0126 3138.5144 3143.9146 3155.4688 3158.9644 3159.7842 3160.4125 3171.8565 3177.5201 3178.8199 3181.5178 3567.9888 3571.1043
redmass: 4.4615 10.5064 9.9647 10.1336 4.5739 6.5513 9.2833 8.3644 8.2253 8.9701 9.8060 7.6249 11.4005 8.0583 10.1971 10.1932 11.7369 6.9848 6.8681 7.0095 6.6446 6.3312 6.7045 3.2849 2.7029 2.8825 3.0992 5.9829 3.0761 2.4065 1.7088 2.3995 7.0845 6.6237 2.5479 2.5282 4.6325 4.3082 7.1529 7.1538 5.2667 5.0428 5.1510 4.9639 3.4584 3.7503 4.0576 3.9732 1.3708 1.2726 1.5888 1.5292 2.6138 3.4839 4.6547 2.5137 1.3749 1.3539 1.3585 1.3584 4.3775 4.4304 3.1591 4.0903 2.5303 2.5165 1.3616 1.3677 1.2727 1.1853 1.1360 1.1409 1.2035 1.1901 1.6010 1.5014 1.2569 1.2588 2.7609 2.6489 3.4935 3.7293 4.1641 4.0906 1.1574 1.1505 2.4316 2.3574 6.0339 6.0265 7.2294 7.3281 6.1475 6.1092 1.0622 1.0567 1.1013 1.1087 1.0885 1.0885 1.0886 1.0885 1.0965 1.0959 1.0975 1.0970 1.0675 1.0675
irintensity: 0.0941 0.0702 0.0738 0.1834 0.0715 0.4165 0.3979 0.0727 0.1528 0.4165 0.4628 0.4268 0.8275 0.8884 0.5536 0.2348 1.3899 0.4646 0.7501 3.8400 5.9618 3.6297 2.0457 2.0771 4.5863 0.2149 4.1214 9.4334 51.2410 59.1438 94.2041 48.8568 26.9986 44.5786 5.8836 2.6206 25.8712 33.9644 0.1935 0.1433 1.7632 0.0312 2.1180 2.1659 11.4613 7.6145 34.3965 4.8276 21.5602 2.0173 48.0343 61.0292 8.1492 49.8000 207.0391 146.0594 0.6348 0.3610 0.7746 1.0531 33.6238 12.1533 28.1650 22.8362 1.3036 72.4286 7.8370 9.1936 7.0433 5.2239 1.3474 0.9574 3.4018 18.8925 26.3097 174.9124 0.5860 1.1895 10.1045 8.2271 1.9224 1.3850 5.2493 14.0730 58.1921 47.3162 81.4653 18.0531 2.6855 1.8706 4.3706 3.5446 19.3418 37.2148 6.5742 8.2759 6.1119 3.4217 2.7591 0.6242 2.4382 0.4169 1.0170 5.6879 3.4886 0.2934 89.3566 94.9119
temp: 298.150 k
press: 1.00000 atm
elementType: 17 17 16 16 8 8 7 7 6 6 6 6 6 6 6 6 6 6 6 6 6 6 6 6 1 1 1 1 1 1 1 1 1 1 1 1 1 1
symmnumber: 1
zpe: 699887.7 jmol-1
zpe.correction: 0.266573 hartree
zpe.thermalcorrener: 0.290125 hartree
zpe.thermalcorrenthalpy: 0.291069 hartree
zpe.thermalcorrgfe: 0.208916 hartree
zpe.sumelectzpe: -2592.465800 hartree
zpe.sumelectthermal: -2592.442248 hartree
zpe.sumelectthermalent: -2592.441304 hartree
zpe.sumelectthermalfe: -2592.523457 hartree
dipole: 3.0065 -0.4009 -1.6101
dipole: 3.4340
quadrupole: -168.5642 -160.6758 -162.1455
quadrupole: 11.6957 -6.0155 5.0762
quadrupole: -4.7690 3.1194 1.6497 11.6957 -6.0155 5.0762
hfenergy: -2592.7323731 hartree
pointgroup: C01 [X(C16H14Cl2N2O2S2)]
dipole: 0.0549425 -1.1672354 -0.6781411 debye
polarizability: 249.9681091|27.7421511|390.7416013|-2.6190024|27.4164038|163.7794795 unknown
InChI: InChI=1S/C16H14Cl2N2O2S2/c17-13-5-1-11(2-6-13)15(19-21)9-23-24-10-16(20-22)12-3-7-14(18)8-4-12/h1-8,21-22H,9-10H2
charge 0 multiplicity 1
38 atoms
Cl 3.63861 2.892204 0.130758
Cl -0.928673 5.847121 0.786996
S  -0.76514 -3.813057 1.121145
S  -1.50044 -1.723235 1.597462
O  1.431384 -4.940237 -1.128105
O  -4.453463 -1.490116 -0.476124
N  1.888589 -3.559208 -1.207354
N  -4.11517 -0.092396 -0.263029
C  2.179685 -1.52344 0.008567
C  -2.348251 1.473717 0.111999
C  1.726976 -2.941788 -0.040766
C  -2.804772 0.07568 -0.119506
C  1.145549 -3.63524 1.16185
C  -1.8223 -1.067581 -0.186716
C  2.023299 -0.733729 1.180926
C  -3.278543 2.554329 0.100123
C  2.799334 -0.924311 -1.129277
C  -0.976855 1.765549 0.344091
C  2.47263 0.604725 1.225826
C  -2.854311 3.879223 0.307042
C  3.245042 0.409651 -1.100019
C  -0.536092 3.091542 0.549305
C  3.075875 1.159029 0.083527
C  -1.483014 4.130641 0.527062
H  1.455802 -4.694698 1.177094
H  1.416155 -3.162252 2.113683
H  -2.252632 -1.917037 -0.734716
H  -0.856335 -0.774212 -0.620407
H  1.5284 -1.137464 2.067501
H  -4.336514 2.340512 -0.074857
H  2.926887 -1.521684 -2.036244
H  -0.231835 0.965435 0.37748
H  2.348284 1.200542 2.134586
H  -3.572373 4.704199 0.295539
H  3.716053 0.860446 -1.978223
H  0.523347 3.306701 0.716311
H  1.603171 -5.276553 -2.044714
H  -5.440158 -1.459405 -0.568714
