program: Gaussian 09
title: 000229577
version: EM64L-G09RevD.01
frameworkgroup: C1[X(C13H26O5S)]
method: RPBEPBE
basis: SDD
operation: Freq
keyword: #p
keyword: freq=noraman
keyword: PBEPBE/SDD
title: #p freq=noraman PBEPBE/SDD
converged: YES YES NO NO
title: Mulliken charges:
elementType: S O O O O O C C C C C C C C C C C C C H H H H H H H H H H H H H H H H H H H H H H H H H H
charge: 0.934024 -0.594206 -0.553960 -0.433004 -0.417340 -0.231225 -0.383594 -0.375791 -0.386177 -0.314953 -0.384110 -0.624100 -0.385117 -0.369129 -0.375974 -0.573752 -0.488070 -0.286527 0.171230 0.203035 0.203070 0.199951 0.200157 0.196247 0.195860 0.244684 0.238370 0.196594 0.195747 0.269848 0.261592 0.197027 0.196669 0.192208 0.192770 0.218540 0.217337 0.246940 0.315494 0.252715 0.252551 0.237224 0.196153 0.375347 0.375647
chargesum: 0.00000
title: Mulliken charges with hydrogens summed into heavy atoms:
elementType: S O O O O O C C C C C C C C C C C C C
charge: 0.934024 -0.594206 -0.553960 -0.057658 -0.041693 -0.231225 0.022511 0.024316 0.005930 0.168101 0.008231 -0.092660 0.008579 0.015849 0.059903 -0.011318 0.017195 0.146851 0.171230
polarizability: 2.56104206e+02 -7.45883691e+00 1.60017931e+02 -6.15108563e-01 5.43661896e+00 1.52044847e+02
1716.lowfreq: -5.3202 -3.3130 -0.0014 0.0014 0.0016 7.3089 8.5056 14.2686 18.5753
frequency: 7.6494 14.0965 18.4374 21.9015 32.0604 42.1366 51.0809 55.1449 77.2090 83.8394 97.5529 111.3691 115.4063 122.7267 145.3050 148.6241 153.0570 191.0517 196.4526 225.8675 229.8159 242.1704 290.0969 313.6348 331.3241 349.4654 383.9836 429.3683 453.9775 474.6658 498.7718 500.7510 553.2661 586.0670 589.4149 639.6057 714.0041 721.9922 726.1354 738.5484 758.6259 764.0944 789.5595 828.1497 832.0428 856.6418 877.4018 902.6764 915.5470 957.6184 982.2513 987.1557 1000.7902 1012.5363 1018.5863 1032.2421 1034.7707 1049.5702 1069.6240 1070.6252 1074.7597 1079.9775 1082.2192 1105.5396 1115.0273 1138.7455 1179.4379 1191.7104 1200.0633 1219.4102 1220.9797 1239.0258 1248.5325 1252.4292 1260.8991 1273.9923 1280.9461 1288.3712 1289.0233 1293.8286 1298.5637 1302.9544 1316.3448 1339.1135 1347.4110 1350.3622 1356.2534 1358.4275 1372.4303 1388.5102 1406.9125 1420.3834 1436.6856 1451.5672 1460.0450 1460.5743 1463.9661 1466.1200 1471.7943 1478.7312 1485.0150 1488.6497 1669.0751 2934.9752 2950.5027 2952.1016 2953.9769 2958.9019 2962.6191 2969.0142 2985.7611 2986.1207 2991.8941 2995.1969 2996.2500 3000.7016 3011.5855 3026.5612 3030.7836 3032.5025 3034.2938 3042.5931 3044.6951 3061.5991 3063.0128 3122.9535 3133.7029 3278.2546 3511.0960
redmass: 5.5161 7.3493 5.7331 4.3101 2.1221 4.9168 2.9447 4.9110 2.0140 2.4682 4.1389 5.9766 1.9701 2.2096 2.1608 3.6442 2.0918 3.6266 5.6227 5.5021 5.1775 3.1257 4.8913 4.7302 5.4434 4.3780 4.5073 3.7553 2.9351 3.1236 2.0086 2.7894 5.4525 4.7194 4.5619 1.3064 1.0968 1.0712 1.0845 1.1200 2.7464 1.5852 1.2817 1.4135 2.1737 4.8305 1.8830 1.8463 2.0125 1.3945 4.5508 4.8985 2.0612 1.2212 3.6198 3.7466 3.2598 3.0844 1.9694 1.4285 2.5527 2.2433 2.1752 3.8280 1.4383 1.2777 1.1620 1.6872 1.2271 1.4425 1.2828 1.3678 1.3159 1.2344 1.3789 1.2200 1.0311 1.3034 1.1099 1.1148 1.1151 1.1031 1.4063 1.4198 1.2440 1.4868 1.6242 1.6303 1.8407 1.1005 1.1102 1.1621 1.0846 1.0796 1.0741 1.0731 1.0647 1.0793 1.0889 1.0959 1.0990 1.1000 8.2370 1.0688 1.0588 1.0589 1.0593 1.0590 1.0591 1.0586 1.0858 1.0719 1.0987 1.0595 1.0588 1.1008 1.1035 1.1025 1.0549 1.1019 1.0628 1.1048 1.0857 1.1032 1.1046 1.1108 1.1089 1.0666 1.0639
irintensity: 2.3475 1.4822 1.0200 1.8019 0.7136 0.3437 0.7227 3.2322 0.2258 0.5908 6.0415 0.3691 0.1629 0.1712 0.3784 1.6500 0.0874 7.4947 5.0348 7.8614 10.4338 4.6169 13.0144 2.1435 12.9784 11.5507 7.5099 17.8031 11.9918 5.6117 23.4589 19.9936 26.5411 14.6916 7.9312 129.9381 154.5647 19.8377 1.3888 9.0822 28.9564 15.1563 4.2292 4.8590 12.4048 1.1398 20.7349 33.9808 69.3504 7.9472 37.1528 9.6158 27.9474 4.9081 104.9516 54.8901 22.2874 111.9052 12.5054 8.0439 31.8798 0.0093 1.6926 6.5562 0.8370 1.7950 32.1213 1.3165 40.1188 1.5373 9.2491 2.9474 0.8835 5.2741 2.7771 0.4870 0.0953 25.0716 5.8431 0.5805 0.1420 0.3194 3.7699 36.2544 2.7995 0.4560 0.2873 3.0930 32.0874 9.2695 3.8382 109.8405 27.6448 8.6582 0.0272 0.2988 0.1043 1.8150 0.3526 3.6717 1.7612 36.2391 208.3879 61.7055 3.6756 1.3799 0.1677 6.5457 25.7813 142.7385 1.5200 3.7841 2.5806 39.3792 13.9917 0.0639 4.6998 2.5549 15.9260 0.0231 7.3521 124.2136 18.8819 69.2381 56.4528 6.4490 2.4112 148.5825 18.5056
temp: 298.150 k
press: 1.00000 atm
elementType: 16 8 8 8 8 8 6 6 6 6 6 6 6 6 6 6 6 6 6 1 1 1 1 1 1 1 1 1 1 1 1 1 1 1 1 1 1 1 1 1 1 1 1 1 1
symmnumber: 1
zpe: 993349.1 jmol-1
zpe.correction: 0.378347 hartree
zpe.thermalcorrener: 0.402940 hartree
zpe.thermalcorrenthalpy: 0.403884 hartree
zpe.thermalcorrgfe: 0.316542 hartree
zpe.sumelectzpe: -1283.446698 hartree
zpe.sumelectthermal: -1283.422105 hartree
zpe.sumelectthermalent: -1283.421160 hartree
zpe.sumelectthermalfe: -1283.508503 hartree
dipole: -2.8327 -1.7460 -3.9283
dipole: 5.1482
quadrupole: -154.0356 -136.9946 -129.0502
quadrupole: -22.9831 -39.4744 0.6351
quadrupole: -14.0088 3.0322 10.9766 -22.9831 -39.4744 0.6351
hfenergy: -1283.8250448 hartree
pointgroup: C01 [X(C13H26O5S1)]
dipole: -1.121631 1.6261292 0.4474249 debye
polarizability: 256.3464539|5.1177994|160.7205346|-2.4787158|-4.658427|151.0999952 unknown
InChI: InChI=1S/C13H26O5S/c14-10-12-19(17,18)11-8-6-4-2-1-3-5-7-9-13(15)16/h14-15H,1-12H2
charge 0 multiplicity 1
45 atoms
S  5.92485 -0.438345 0.586177
O  5.93156 -1.325629 -0.814766
O  5.932766 -1.180568 2.040657
O  8.246379 -0.130442 -1.724765
O  -9.536019 -0.768505 -0.506856
O  -8.576653 1.330591 -0.753871
C  0.545637 -0.302202 0.300437
C  1.801883 0.598843 0.321653
C  -0.767791 0.493742 0.131406
C  3.105723 -0.230647 0.444732
C  -2.023663 -0.406831 0.125173
C  4.334317 0.677032 0.495357
C  -3.337218 0.379884 -0.082198
C  -4.59241 -0.52133 -0.082445
C  -5.89858 0.269616 -0.312804
C  7.467214 0.755648 0.45752
C  -7.139077 -0.643454 -0.307162
C  7.768766 1.045078 -1.020354
C  -8.435065 0.106109 -0.545068
H  0.5019 -0.890778 1.239835
H  0.637088 -1.037886 -0.525012
H  1.832605 1.207664 -0.605321
H  1.727371 1.311686 1.168578
H  -0.856165 1.239847 0.948624
H  -0.727591 1.071708 -0.815516
H  3.192665 -0.917813 -0.418479
H  3.067978 -0.851194 1.360508
H  -2.0776 -0.967224 1.081855
H  -1.923092 -1.168783 -0.675901
H  4.391607 1.297511 1.405508
H  4.475528 1.275578 -0.420192
H  -3.437232 1.146927 0.713833
H  -3.284512 0.934031 -1.042479
H  -4.483816 -1.296853 -0.869667
H  -4.651697 -1.064944 0.883868
H  -5.845795 0.810979 -1.276811
H  -6.01096 1.047044 0.467232
H  7.195954 1.638707 1.061372
H  8.258142 0.161237 0.942856
H  -7.232764 -1.185398 0.654473
H  -7.057239 -1.430487 -1.082898
H  8.589596 1.784495 -1.061974
H  6.882724 1.500884 -1.517404
H  7.513111 -0.818728 -1.670345
H  -10.369825 -0.2483 -0.668271
