program: Gaussian 09
title: 000229574
version: EM64L-G09RevD.01
frameworkgroup: C1[X(C13H24O4S)]
method: RPBEPBE
basis: SDD
operation: Freq
keyword: #p
keyword: freq=noraman
keyword: PBEPBE/SDD
title: #p freq=noraman PBEPBE/SDD
converged: YES YES NO NO
title: Mulliken charges:
elementType: S O O O O C C C C C C C C C C C C C H H H H H H H H H H H H H H H H H H H H H H H H
charge: 0.169144 -0.418159 -0.230709 -0.423210 -0.224639 -0.386072 -0.383222 -0.372271 -0.385547 -0.341602 -0.368513 -0.353576 -0.376470 -0.696062 -0.487694 0.170872 -0.723692 0.276450 0.194137 0.197717 0.192706 0.193409 0.190717 0.188698 0.196712 0.197643 0.187145 0.213153 0.191116 0.191425 0.210531 0.205851 0.217055 0.219297 0.247621 0.299571 0.251967 0.252168 0.273672 0.285294 0.375212 0.382153
chargesum: 0.00000
title: Mulliken charges with hydrogens summed into heavy atoms:
elementType: S O O O O C C C C C C C C C C C C C
charge: 0.169144 -0.042947 -0.230709 -0.041057 -0.224639 0.005782 0.002893 0.007143 0.008809 0.058697 0.014029 0.062805 0.059882 -0.148870 0.016442 0.170872 -0.164725 0.276450
polarizability: 2.28389330e+02 -6.72560734e+00 1.49449807e+02 -8.04193006e+00 -4.50852286e+00 1.41887982e+02
1716.lowfreq: -14.8001 -2.1496 -0.0021 -0.0019 -0.0012 1.2808 8.4977 11.1772 16.5855
frequency: -6.3305 10.8225 16.1290 30.6259 36.5209 46.7864 50.9172 70.2147 76.2702 83.0504 104.6558 106.8266 123.9008 140.8406 152.3762 163.7842 173.6758 181.9857 216.4792 270.2169 303.5516 344.9934 382.1779 393.3677 461.6500 468.7407 500.1393 505.1678 512.3555 573.7536 588.5789 597.2905 636.7682 647.9622 723.1782 725.6177 730.2434 736.7517 762.9229 802.8373 820.4372 836.0822 856.8094 871.3512 888.1911 939.0365 977.5898 988.3149 1005.6272 1020.6501 1024.4613 1050.9201 1060.0443 1064.5318 1078.9612 1081.0853 1082.7794 1101.9338 1104.8910 1117.2892 1172.5066 1184.1266 1195.4672 1214.8797 1225.2065 1229.8561 1239.0816 1254.2775 1260.3297 1274.0927 1280.8148 1286.0285 1287.2371 1290.0139 1297.2917 1298.1817 1306.9262 1314.0724 1339.0637 1355.9460 1357.2144 1360.8132 1372.8045 1423.0354 1436.6923 1442.3483 1455.5614 1461.0095 1461.4067 1465.0011 1468.0917 1475.8454 1483.1664 1487.8349 1668.3859 1669.6485 2949.6171 2950.3150 2951.9199 2955.2256 2957.0032 2962.9701 2966.8889 2984.1188 2986.2550 2989.3834 2995.4146 2995.9856 3000.4954 3015.9901 3021.3260 3029.4781 3035.2618 3043.8724 3056.7903 3062.0369 3093.5314 3145.5050 3511.4296 3515.3823
redmass: 7.8590 8.4810 6.2017 5.1658 5.5638 2.1683 4.3854 3.5842 4.9018 1.8882 3.5734 2.9928 2.0682 2.3271 2.0353 2.5687 4.6795 5.1123 5.9227 3.0547 3.0256 3.6924 3.7611 2.2670 3.1067 3.4755 1.7868 4.1656 2.9957 2.7430 4.6647 3.7038 1.3224 1.7171 1.0615 1.0941 5.2549 1.1612 1.2449 1.4419 2.0459 2.5660 4.8551 1.4499 1.8491 1.4029 2.7604 4.9449 1.4772 2.2258 3.4113 1.7433 2.6920 2.3654 2.0039 2.1382 2.1355 2.1936 2.2712 1.4243 1.2374 1.2609 1.5555 1.3251 1.3256 1.2408 1.3790 1.3026 1.3679 1.2189 1.0530 1.3231 1.1348 1.1892 1.0980 1.1728 1.7315 1.4074 1.4768 1.5524 1.7191 1.6377 1.8311 1.1100 1.0849 1.0889 1.0789 1.0786 1.0692 1.0616 1.0894 1.0963 1.0995 1.1005 8.5542 8.2340 1.0589 1.0586 1.0589 1.0597 1.0598 1.0602 1.0603 1.0959 1.0615 1.0970 1.0602 1.0952 1.0985 1.0944 1.0737 1.0996 1.1025 1.1039 1.0589 1.1032 1.1060 1.1065 1.0639 1.0640
irintensity: 0.1946 0.4130 0.4992 0.3050 0.6742 0.0992 0.6816 0.3684 0.8170 0.1320 0.2745 0.0553 0.2056 0.3537 0.1628 1.0512 0.5460 0.2589 5.2701 0.5314 0.8561 2.2051 1.5886 3.9457 0.2392 21.6483 28.3757 36.7069 7.4858 36.6587 14.7868 14.0279 128.1059 118.0156 19.6969 0.2708 10.4022 8.7397 1.4508 8.8404 24.5936 5.3070 1.1996 0.3589 3.6409 3.6331 3.8769 46.0236 3.2320 20.2054 146.2179 103.6066 60.8718 43.6029 37.8886 0.3878 11.0669 20.7872 9.1598 0.7441 20.2795 34.2607 8.1313 11.7385 0.4688 1.7030 0.2416 0.5708 6.5810 2.7044 4.1258 8.2682 2.3865 14.2588 1.2402 4.3131 27.2319 11.6801 13.4687 8.7540 1.6772 0.2800 29.2564 21.8443 27.8364 6.6498 5.4665 0.4976 0.0977 0.1110 0.2498 4.4347 0.2439 32.2783 305.8682 215.0135 0.6524 0.5349 7.5086 16.5388 0.2954 13.5896 180.8583 2.8274 5.2122 1.1242 37.0756 12.6915 0.8311 1.1158 20.6413 1.4139 1.0118 191.9238 7.6545 90.0500 6.0239 0.6757 17.9063 24.1579
temp: 298.150 k
press: 1.00000 atm
elementType: 16 8 8 8 8 6 6 6 6 6 6 6 6 6 6 6 6 6 1 1 1 1 1 1 1 1 1 1 1 1 1 1 1 1 1 1 1 1 1 1 1 1
symmnumber: 1
zpe: 929471.9 jmol-1
zpe.correction: 0.354017 hartree
zpe.thermalcorrener: 0.375765 hartree
zpe.thermalcorrenthalpy: 0.376709 hartree
zpe.thermalcorrgfe: 0.297446 hartree
zpe.sumelectzpe: -1207.297098 hartree
zpe.sumelectthermal: -1207.275351 hartree
zpe.sumelectthermalent: -1207.274407 hartree
zpe.sumelectthermalfe: -1207.353669 hartree
dipole: -1.1622 3.4821 -2.0220
dipole: 4.1910
quadrupole: -137.0975 -119.8837 -120.5221
quadrupole: 14.2233 3.7082 6.1456
quadrupole: -11.2631 5.9507 5.3123 14.2233 3.7082 6.1456
hfenergy: -1207.6511155 hartree
pointgroup: C01 [X(C13H24O4S1)]
dipole: 0.4375754 0.9593554 1.2676321 debye
polarizability: 228.3228042|9.9116008|145.2556904|-4.0762974|5.9137841|146.148624 unknown
InChI: InChI=1S/C13H24O4S/c14-12(15)9-7-5-3-1-2-4-6-8-10-18-11-13(16)17/h14,16H,1-11H2
charge 0 multiplicity 1
42 atoms
S  -5.349971 -0.315798 -1.302665
O  8.990588 -0.203299 0.837619
O  8.002813 -0.556361 -1.233032
O  -7.604759 0.482977 1.076808
O  -8.539163 -1.41553 0.109138
C  0.239572 0.708724 -0.386361
C  1.504377 0.69468 0.501283
C  -1.054373 1.013961 0.401523
C  2.798451 0.381155 -0.282831
C  -2.317768 1.037955 -0.487475
C  4.062482 0.375669 0.605964
C  -3.606341 1.339169 0.308099
C  5.35126 0.057102 -0.183167
C  -4.885232 1.368503 -0.545191
C  6.59972 0.063683 0.719159
C  7.879719 -0.263494 -0.023996
C  -6.081725 -1.174928 0.227808
C  -7.521083 -0.773186 0.441593
H  0.365507 1.462393 -1.19161
H  0.135807 -0.27294 -0.893861
H  1.609812 1.679296 1.00365
H  1.375265 -0.054527 1.31046
H  -1.183341 0.254108 1.200873
H  -0.946567 1.991667 0.917077
H  2.925274 1.126502 -1.095391
H  2.695749 -0.605675 -0.780327
H  -2.192503 1.802441 -1.282985
H  -2.430571 0.063087 -1.002716
H  4.164429 1.364697 1.100527
H  3.932045 -0.367716 1.42044
H  -3.509126 2.328919 0.803427
H  -3.71831 0.599868 1.128198
H  5.483566 0.792521 -0.999867
H  5.258174 -0.930361 -0.674396
H  -4.76744 2.025175 -1.426089
H  -5.763592 1.702572 0.031705
H  6.494758 -0.665965 1.546652
H  6.73423 1.048074 1.209048
H  -5.459703 -0.921386 1.099779
H  -6.028437 -2.252461 0.018161
H  9.81318 -0.42585 0.322174
H  -8.563472 0.737785 1.163398
