program: Gaussian 09
title: 000229550
version: EM64L-G09RevD.01
frameworkgroup: C1[X(C12H10BrN)]
method: RPBEPBE
basis: SDD
operation: Freq
keyword: #p
keyword: freq=noraman
keyword: PBEPBE/SDD
title: #p freq=noraman PBEPBE/SDD
converged: YES YES NO NO
title: Mulliken charges:
elementType: Br N C C C C C C C C C C C C H H H H H H H H H H
charge: -0.020809 -0.692175 0.213416 0.299431 0.295743 -0.310979 -0.400504 -0.432533 -0.408997 -0.252559 -0.178314 -0.227003 -0.226327 -0.241487 0.262966 0.251596 0.274611 0.220092 0.244959 0.228502 0.228534 0.231791 0.304652 0.335394
chargesum: 0.00000
title: Mulliken charges with hydrogens summed into heavy atoms:
elementType: Br N C C C C C C C C C C C C
charge: -0.020809 -0.052129 0.213416 0.299431 0.295743 -0.048012 -0.148908 -0.157922 -0.188905 -0.252559 0.066645 0.001499 0.002207 -0.009696
polarizability: 2.28811283e+02 -5.02065837e+00 1.58075885e+02 6.79699161e+00 9.09052974e+00 7.80045992e+01
1716.lowfreq: -7.6181 -3.7401 -1.7530 -0.0002 0.0003 0.0005 53.5564 71.6789 89.0987
frequency: 53.5296 71.6725 89.0969 111.3231 181.0637 245.0409 261.3815 278.2773 316.4941 339.9028 369.8497 402.9814 427.5472 445.7113 483.0712 523.6440 565.7797 610.3140 614.6544 622.7931 709.0209 720.2427 732.3907 773.2574 806.2114 828.2512 861.0006 885.1999 929.0909 934.9312 981.9037 987.4632 996.4164 998.1481 1019.3068 1039.9469 1076.5486 1083.0364 1152.8912 1173.3511 1191.7348 1257.5803 1270.5704 1310.9373 1314.3812 1369.2205 1376.0960 1398.5304 1435.7836 1473.6276 1495.0931 1569.2999 1581.6280 1603.9386 1610.0258 1634.9315 3122.5543 3126.2623 3127.6992 3140.3240 3148.7179 3155.6893 3165.0978 3168.0724 3549.7830 3692.8263
redmass: 4.2328 5.8711 4.3777 5.8433 5.7084 5.2305 7.9660 5.4282 4.8424 2.6401 1.4386 2.2835 2.9006 1.2011 3.2738 3.4892 4.1288 6.8312 6.4732 6.8639 2.1600 2.6839 4.6784 1.9647 1.5916 5.6756 1.2442 1.3843 1.3899 1.3491 1.5516 4.0312 1.8986 2.4782 1.7260 1.7785 1.9904 1.7166 1.2209 1.0531 1.1164 2.7849 1.4614 2.1759 1.4340 5.2395 7.6196 3.8629 2.4396 2.4986 2.9672 6.4011 6.3119 4.8788 5.9289 1.2616 1.0849 1.0892 1.0873 1.0921 1.0964 1.0921 1.1016 1.0956 1.0452 1.1037
irintensity: 0.5652 0.9263 0.3130 0.9394 0.1112 2.5342 2.7454 2.5729 5.0442 22.2750 161.6330 2.7555 6.0989 82.5916 4.9198 0.8990 11.5417 41.9480 1.8138 3.3348 28.3543 25.3983 8.4318 29.9509 54.6864 11.2233 1.1226 9.8794 1.3181 0.9069 0.8533 1.5866 5.1765 6.0327 18.0740 3.3523 4.6596 13.1279 22.3643 0.0225 0.2602 2.2493 19.0341 21.1781 6.5842 5.7600 17.2535 36.1515 5.0990 143.0084 58.0515 4.6120 5.8252 1.3259 14.6559 182.8175 4.6272 18.1514 0.4200 13.6787 33.2812 2.0236 25.8535 6.5250 59.4049 36.4468
temp: 298.150 k
press: 1.00000 atm
elementType: 35 7 6 6 6 6 6 6 6 6 6 6 6 6 1 1 1 1 1 1 1 1 1 1
symmnumber: 1
zpe: 484446.6 jmol-1
zpe.correction: 0.184516 hartree
zpe.thermalcorrener: 0.196683 hartree
zpe.thermalcorrenthalpy: 0.197627 hartree
zpe.thermalcorrgfe: 0.144899 hartree
zpe.sumelectzpe: -530.526692 hartree
zpe.sumelectthermal: -530.514525 hartree
zpe.sumelectthermalent: -530.513581 hartree
zpe.sumelectthermalfe: -530.566309 hartree
dipole: 3.5926 2.4870 -0.6308
dipole: 4.4147
quadrupole: -85.2544 -75.8977 -94.2406
quadrupole: -1.5595 1.1385 1.0702
quadrupole: -0.1235 9.2332 -9.1097 -1.5595 1.1385 1.0702
hfenergy: -530.7112079 hartree
pointgroup: C01 [X(C12H10Br1N1)]
dipole: -1.0742107 1.340832 -0.2548995 debye
dipolederiv: -0.3761582 0.2740152 -0.083062 0.3778614 -0.4483698 0.1145446 -0.1164495 0.110506 -0.0866509 -0.522493 0.6314186 -0.1498485 0.4913481 -1.0653304 0.1178776 -0.1641999 0.1719471 -0.691261 0.0224232 -0.0621552 0.0189579 0.3838347 -0.2061776 0.0591652 -0.0654732 0.0193058 -0.1002356 0.4839534 0.1111188 -0.0065621 0.0559494 -0.0592827 -0.0129044 -0.0634418 0.0131873 0.0061501 0.2841044 -0.757521 0.1559352 -0.6297175 0.9841864 -0.1885514 0.0650121 -0.2053059 0.1590176 0.0842119 0.1028195 -0.0173605 0.0481204 -0.1293769 0.0353079 0.0811937 0.047984 -0.0799978 -0.1874638 -0.0275703 0.0753293 -0.053634 -0.1265274 -0.0539492 0.1042021 -0.0365425 0.0077088 -0.2172071 0.0004327 -0.0477836 -0.0076611 -0.1425205 -0.0502398 -0.0460251 -0.069927 0.0062628 -0.0557277 0.4170184 -0.0779122 -0.0066143 -0.0885093 -0.0369125 0.0408445 -0.0276829 -0.2051322 0.2161118 -0.5935482 0.172184 -0.8298779 0.5518839 -0.2257587 0.2003431 -0.2099445 -0.1035783 -0.1417793 0.1026529 -0.0346001 0.3065059 0.0547723 -0.0191946 -0.0820689 -0.0322118 -0.0767745 0.0025425 0.0465074 -0.0479721 0.0366374 -0.0841842 -0.1066716 -0.0862252 -0.1177196 0.0556062 0.0331383 0.015297 0.0736 0.0077917 -0.0955723 -0.083467 0.1043157 -0.0858176 0.0557461 0.0134512 0.0290313 0.0066825 0.0291226 -0.1467204 -0.0338427 0.0158934 -0.0216767 -0.1066137 0.0963163 -0.0714283 0.0173296 -0.0774875 -0.0036685 0.0251859 0.0145511 0.0324975 0.1316758 0.0412149 0.0260515 -0.0987527 0.0216405 0.1185352 0.05299 -0.0933843 0.044651 -0.0000871 0.0732883 -0.0476422 0.0734142 -0.0262784 0.0968939 0.077092 0.0807409 0.0656343 0.0034482 0.0252738 -0.0257922 0.0001036 -0.0660101 -0.1231553 0.0676213 0.006601 0.0639306 0.150734 -0.0711439 -0.0235982 -0.0015396 -0.0181521 0.1131843 0.0106104 -0.0051634 0.0156313 0.1546172 0.0233716 -0.0506311 0.0587528 -0.0651954 0.094368 0.0999421 0.0855426 0.1029471 -0.0253052 -0.0035959 0.0148495 -0.0925285 0.0254885 0.1208741 0.0747094 -0.118227 0.0672099 -0.0327745 -0.1352351 -0.0493665 -0.0086237 -0.0491899 0.1391735 0.0312613 -0.0062236 0.0267775 0.104839 0.1122468 -0.0493937 0.0050364 -0.0362501 0.20557 0.0209261 0.0035967 -0.0144546 0.3684402 0.1991556 -0.012566 0.0092202 0.0817678 0.2399539 0.024258 0.0440449 0.0390739 0.3041648 unknown
polarizability: 225.2273814|-11.4562673|144.6217385|13.0627242|-35.0407379|95.0426466 unknown
InChI: InChI=1S/C12H10BrN/c13-10-6-7-12(14)11(8-10)9-4-2-1-3-5-9/h1-8H,14H2
charge 0 multiplicity 1
24 atoms
Br 3.812938 -2.290165 0.832146
N  0.179432 2.544788 -0.520074
C  0.398689 0.14889 0.044926
C  -1.078428 -0.080399 0.035508
C  0.976656 1.431575 -0.250514
C  1.260674 -0.929313 0.372625
C  -1.708357 -0.750572 1.120756
C  -1.886537 0.317591 -1.067864
C  2.39505 1.569314 -0.23797
C  2.65629 -0.760592 0.385951
C  3.237309 0.485295 0.074172
C  -3.096529 -1.007936 1.109037
C  -3.275341 0.060783 -1.079213
C  -3.888408 -0.600261 0.010436
H  0.823447 -1.90957 0.586207
H  -1.104489 -1.052341 1.984345
H  -1.415808 0.788731 -1.938617
H  2.841868 2.544749 -0.464936
H  4.32353 0.614221 0.077772
H  -3.560384 -1.521786 1.958534
H  -3.875256 0.364299 -1.944772
H  -4.965681 -0.799226 0.00122
H  0.605705 3.45749 -0.651206
H  -0.832372 2.489233 -0.437269
