program: Gaussian 09
title: 000229549
version: EM64L-G09RevD.01
frameworkgroup: C1[X(C16H15NO)]
method: RPBEPBE
basis: SDD
operation: Freq
keyword: #p
keyword: freq=noraman
keyword: PBEPBE/SDD
title: #p freq=noraman PBEPBE/SDD
converged: YES YES NO NO
title: Mulliken charges:
elementType: O N C C C C C C C C C C C C C C C C H H H H H H H H H H H H H H H
charge: -0.429581 -0.100766 0.283937 0.334725 -0.368064 0.351384 0.034478 -0.825022 -0.379596 -0.386125 -0.398015 -0.381336 -0.243095 -0.237788 -0.241964 -0.232548 -0.230329 -0.242113 0.236262 0.240290 0.224994 0.259999 0.239474 0.237912 0.256104 0.260890 0.226819 0.225087 0.230125 0.227658 0.226893 0.228858 0.370454
chargesum: 0.00000
title: Mulliken charges with hydrogens summed into heavy atoms:
elementType: O N C C C C C C C C C C C C C C C C
charge: -0.059127 -0.100766 0.283937 0.334725 -0.131802 0.351384 0.034478 -0.099739 -0.140122 -0.148213 -0.141911 -0.120446 -0.016277 -0.012701 -0.011839 -0.004890 -0.003436 -0.013256
polarizability: 2.84837110e+02 -4.07603790e+00 2.11220919e+02 -1.39473785e+01 9.41928303e-01 9.88239491e+01
1716.lowfreq: -11.8923 -4.6994 -0.0008 -0.0007 -0.0004 5.8111 27.3809 42.3328 44.8700
frequency: 27.2833 42.3045 44.8196 83.4293 92.0680 114.7279 144.3659 168.3507 202.5694 218.3904 245.1281 299.7815 315.8472 360.8403 397.9068 403.5568 406.3622 431.2389 448.3686 468.3500 519.5656 554.2791 597.2838 614.2770 617.0222 639.0425 652.7766 697.1932 701.2997 752.0318 767.7974 779.2781 788.2349 847.4758 855.6908 875.5025 885.7211 920.1808 931.1346 960.1830 975.3337 981.2930 987.7826 988.9753 994.5042 996.9072 1023.5987 1025.6925 1036.7988 1067.5338 1080.8716 1092.9676 1105.5622 1172.4091 1174.3103 1188.0098 1199.1213 1236.8189 1270.0112 1315.1536 1315.9974 1339.6769 1362.6763 1377.1805 1381.5215 1396.7504 1430.7338 1435.3512 1460.3288 1472.7775 1483.2369 1486.5373 1515.2602 1580.3844 1585.2552 1607.6515 1609.7296 1629.2722 2977.8916 3054.6044 3120.6270 3123.3629 3123.9324 3125.0043 3132.1214 3132.9302 3145.5223 3145.8266 3153.5577 3156.8839 3166.6071 3168.2281 3563.0684
redmass: 4.1403 4.4777 3.9312 4.7734 3.3409 5.0012 5.0016 1.1439 4.7458 3.6348 4.9024 4.5500 3.7606 6.1188 3.0826 2.8308 2.8469 3.1398 2.8296 1.7014 3.5329 2.4503 4.9508 6.4144 6.3713 5.3156 4.7760 1.7491 1.8086 2.7048 1.8020 3.2776 2.7432 1.2680 1.2613 4.6959 1.8868 1.4549 1.4764 2.7139 1.4197 1.3925 5.0661 6.1898 1.3477 1.3138 2.3739 2.3662 1.5387 1.7929 1.6106 1.6292 2.9189 1.0535 1.0523 1.1159 1.1270 1.4693 2.5723 1.4938 1.4328 2.3442 1.8312 7.5808 3.9254 1.2484 2.2919 2.2892 1.1007 1.0931 2.2857 2.1792 5.1037 5.5015 6.2032 5.9510 6.0447 6.8228 1.0416 1.0946 1.0955 1.0866 1.0848 1.0857 1.0873 1.0881 1.0921 1.0933 1.0956 1.0963 1.1013 1.1003 1.0672
irintensity: 0.0505 0.0539 0.2263 0.9080 0.5138 0.4473 0.0103 1.2032 0.3023 0.1658 1.5264 2.4182 0.6992 5.9777 8.6852 0.6895 0.1545 34.6241 12.1351 88.8008 7.9924 5.5168 7.9872 0.8243 0.8785 22.1002 4.6328 44.0603 43.2347 37.1488 91.3815 11.6208 16.0589 1.0436 3.1546 99.9336 86.7977 1.4831 4.8486 28.9662 0.5157 1.0740 0.1563 0.2148 0.0854 0.2957 0.8287 16.6483 1.4221 2.5511 9.1768 6.8052 11.5261 0.0231 0.1021 4.3708 1.0488 103.3625 9.2012 7.3443 5.9151 35.4948 1.3539 0.2687 1.6777 14.9730 7.3649 14.5722 24.4802 15.2095 15.7117 4.6634 19.6351 6.1218 1.2765 0.5637 0.7551 41.9165 16.8684 20.1387 10.5376 16.1408 0.6318 1.4160 2.9213 5.0663 21.1310 23.4355 35.4580 24.3395 25.2489 16.1129 65.5225
temp: 298.150 k
press: 1.00000 atm
elementType: 8 7 6 6 6 6 6 6 6 6 6 6 6 6 6 6 6 6 1 1 1 1 1 1 1 1 1 1 1 1 1 1 1
symmnumber: 1
zpe: 691117.4 jmol-1
zpe.correction: 0.263233 hartree
zpe.thermalcorrener: 0.279350 hartree
zpe.thermalcorrenthalpy: 0.280295 hartree
zpe.thermalcorrgfe: 0.218406 hartree
zpe.sumelectzpe: -747.350235 hartree
zpe.sumelectthermal: -747.334117 hartree
zpe.sumelectthermalent: -747.333173 hartree
zpe.sumelectthermalfe: -747.395061 hartree
dipole: 0.5116 -0.9772 0.1852
dipole: 1.1185
quadrupole: -94.2974 -90.8316 -108.8172
quadrupole: 1.4608 -4.2928 -0.1815
quadrupole: 3.6847 7.1505 -10.8352 1.4608 -4.2928 -0.1815
hfenergy: -747.6134676 hartree
pointgroup: C01 [X(C16H15N1O1)]
dipole: -0.191117 -0.3634483 -0.158202 debye
polarizability: 283.2852012|11.1265557|205.8760742|-18.2677636|24.5900103|105.7207031 unknown
InChI: InChI=1S/C16H15NO/c1-13(14-8-4-2-5-9-14)12-16(17-18)15-10-6-3-7-11-15/h2-12,18H,1H3
charge 0 multiplicity 1
33 atoms
O  0.503514 3.453624 0.766233
N  1.637218 2.541485 0.565247
C  -0.907226 0.051044 -0.427252
C  -2.363847 -0.192026 -0.185759
C  -0.215606 0.928088 0.375877
C  2.311494 0.321293 0.077983
C  1.20831 1.303095 0.309547
C  -0.277428 -0.681787 -1.601577
C  -3.193609 0.771009 0.46103
C  -2.973516 -1.404727 -0.617975
C  2.190012 -1.018984 0.534893
C  3.517587 0.723636 -0.55886
C  -4.561466 0.519398 0.688415
C  -4.342273 -1.660088 -0.385957
C  -5.144922 -0.700921 0.271695
C  3.248998 -1.934686 0.357577
C  4.573682 -0.194246 -0.736097
C  4.444609 -1.527764 -0.279858
H  -0.769939 1.473631 1.149709
H  -0.944449 -0.636446 -2.481539
H  -0.105708 -1.751917 -1.373354
H  0.695203 -0.250567 -1.877882
H  -2.774154 1.738864 0.756031
H  -2.371082 -2.164533 -1.126726
H  1.270854 -1.331895 1.042472
H  3.610267 1.756289 -0.909284
H  -5.177807 1.281241 1.179031
H  -4.781507 -2.607062 -0.719599
H  -6.209002 -0.894218 0.446944
H  3.144513 -2.962973 0.721705
H  5.495933 0.127566 -1.23285
H  5.26476 -2.240779 -0.420341
H  0.96409 4.297657 1.009422
