program: Gaussian 09
title: 000229547
version: EM64L-G09RevD.01
frameworkgroup: C1[X(C15H13BrO)]
method: RPBEPBE
basis: SDD
operation: Freq
keyword: #p
keyword: freq=noraman
keyword: PBEPBE/SDD
title: #p freq=noraman PBEPBE/SDD
converged: YES YES NO NO
title: Mulliken charges:
elementType: Br O C C C C C C C C C C C C C C C H H H H H H H H H H H H H
charge: -0.011247 -0.204882 0.361487 0.328201 0.338759 -0.411959 -0.394216 -0.342033 -0.366430 0.186379 -0.557440 -0.387673 -0.390043 -0.650860 -0.235694 -0.235054 -0.236585 0.242457 0.244268 0.244953 0.276452 0.293495 0.240248 0.240103 0.236611 0.270096 0.227984 0.229554 0.229619 0.233449
chargesum: 0.00000
title: Mulliken charges with hydrogens summed into heavy atoms:
elementType: Br O C C C C C C C C C C C C C C C
charge: -0.011247 -0.204882 0.361487 0.328201 0.338759 -0.169502 -0.149948 -0.097080 -0.089978 0.186379 -0.263946 -0.147425 -0.149939 0.083831 -0.006140 -0.005434 -0.003136
polarizability: 3.24326210e+02 1.81974074e+01 1.77723169e+02 1.68769995e+00 -5.16315713e+00 9.77065859e+01
1716.lowfreq: -7.0928 -3.0360 -0.0005 -0.0004 -0.0003 5.1892 23.5787 35.8129 56.7608
frequency: 23.1534 35.5424 56.7581 76.3885 83.3168 116.3314 143.2405 192.2470 213.9398 226.8591 274.0162 278.9267 314.1464 388.3754 401.3119 403.9897 408.8945 457.5544 498.1388 511.5485 551.1854 613.0604 626.8757 634.0538 691.1559 700.5670 707.1770 750.2927 766.4308 783.2584 841.1985 850.2472 868.8177 924.2906 946.2971 967.9014 976.1529 986.7500 988.3979 996.0132 997.5590 1001.4472 1017.9481 1040.8361 1054.3933 1086.7848 1098.1513 1128.6760 1163.5909 1175.4966 1193.8639 1208.9375 1245.1909 1293.0729 1306.8394 1314.1772 1333.2275 1361.2552 1377.5858 1392.9525 1421.2878 1438.3362 1455.2868 1460.1621 1476.1203 1513.6677 1545.2223 1577.5323 1588.5277 1610.9850 1618.8642 2991.6333 3076.5043 3088.9495 3125.9799 3129.6759 3129.8666 3138.9603 3140.1133 3143.4473 3151.7078 3160.0890 3164.7189 3167.7083
redmass: 6.9593 4.7265 7.3362 3.8804 4.4105 8.5909 5.1488 5.4222 3.1834 1.1684 4.5563 3.8196 5.1318 4.2864 3.8612 3.1556 3.1293 5.7056 3.8058 5.0139 2.8377 6.5390 5.7900 6.9254 3.7555 1.7744 3.9459 2.3318 4.5217 2.6510 1.3739 1.2511 1.5383 1.4510 4.2706 1.3961 1.4609 1.5560 4.6378 5.6441 1.3202 1.4027 2.6477 1.9062 1.4181 1.6227 2.2808 1.3886 1.4242 1.0536 1.1223 1.1739 2.3514 2.8186 1.4030 1.5434 1.6669 2.6950 9.6297 1.2129 4.1083 2.3814 1.0444 1.0525 2.1321 2.7754 7.0895 6.9964 6.7072 5.9880 6.3682 1.0400 1.0866 1.0935 1.0847 1.0884 1.1002 1.0877 1.0883 1.0908 1.0963 1.0953 1.0970 1.1014
irintensity: 0.7797 0.3001 0.5266 0.4905 1.3675 1.4687 2.1422 3.6170 0.5238 0.1560 1.9301 3.4678 8.7162 4.9099 4.3968 1.3446 1.0553 5.9872 25.8367 17.3276 8.1960 0.0385 1.1861 0.1743 0.7961 44.6574 13.4241 63.5013 11.0405 21.1905 6.8680 0.7294 29.5692 2.0851 65.3459 1.1758 1.3583 24.2719 0.5540 8.9948 0.0532 3.6239 4.5000 0.9668 11.7291 8.5856 12.2734 11.3198 74.7344 0.0354 0.3582 42.7651 191.1513 3.3353 9.0011 3.7947 44.7817 24.5722 1.2326 40.3511 18.4327 8.0077 13.7806 22.6091 9.2593 4.0190 138.3694 154.3063 27.8340 4.5707 90.5028 13.2115 5.6625 20.5460 6.7479 1.7812 7.2880 15.2807 6.4986 2.7482 31.8554 20.5276 0.1557 30.4628
temp: 298.150 k
press: 1.00000 atm
elementType: 35 8 6 6 6 6 6 6 6 6 6 6 6 6 6 6 6 1 1 1 1 1 1 1 1 1 1 1 1 1
symmnumber: 1
zpe: 612381.2 jmol-1
zpe.correction: 0.233244 hartree
zpe.thermalcorrener: 0.248598 hartree
zpe.thermalcorrenthalpy: 0.249542 hartree
zpe.thermalcorrgfe: 0.188014 hartree
zpe.sumelectzpe: -666.896436 hartree
zpe.sumelectthermal: -666.881082 hartree
zpe.sumelectthermalent: -666.880138 hartree
zpe.sumelectthermalfe: -666.941666 hartree
dipole: -3.4193 -0.7845 2.3871
dipole: 4.2432
quadrupole: -97.7558 -106.5013 -111.0338
quadrupole: -1.1471 8.8638 -0.1886
quadrupole: 7.3412 -1.4044 -5.9368 -1.1471 8.8638 -0.1886
hfenergy: -667.12968 hartree
pointgroup: C01 [X(C15H13Br1O1)]
dipole: -1.3365224 -0.9172131 0.399245 debye
polarizability: 326.0353688|8.6449686|129.8753127|3.2568682|38.807776|143.8452829 unknown
InChI: InChI=1S/C15H13BrO/c1-11(16)15(17)14-9-7-13(8-10-14)12-5-3-2-4-6-12/h2-11H,1H3
charge 0 multiplicity 1
30 atoms
Br 4.415836 -0.554469 -1.801141
O  3.667063 1.655829 1.050584
C  -1.110484 0.096491 0.149867
C  1.734295 0.365516 0.41092
C  -2.586813 -0.045834 0.016782
C  -0.231876 -0.946452 -0.258507
C  -0.53042 1.281275 0.689649
C  1.162867 -0.817999 -0.13209
C  0.860723 1.413377 0.816541
C  3.204538 0.569781 0.590343
C  4.183341 -0.573485 0.253316
C  -3.156636 -0.80151 -1.046223
C  -3.46697 0.572934 0.948386
C  5.549665 -0.425114 0.912425
C  -4.555194 -0.933839 -1.173056
C  -4.865617 0.438711 0.823738
C  -5.417586 -0.315255 -0.238043
H  -0.649105 -1.878616 -0.653755
H  -1.178542 2.114698 0.980948
H  1.799659 -1.639764 -0.474281
H  1.307061 2.327512 1.221593
H  3.738988 -1.565485 0.431659
H  -2.503503 -1.259045 -1.797849
H  -3.054204 1.135063 1.793716
H  6.236923 -1.21825 0.575889
H  5.984465 0.561815 0.691354
H  5.431904 -0.499486 2.010998
H  -4.972527 -1.510506 -2.005882
H  -5.524267 0.914823 1.558471
H  -6.503782 -0.418118 -0.336151
