program: Gaussian 09
title: 000229544
version: EM64L-G09RevD.01
frameworkgroup: C1[X(C22H18N2O2)]
method: RPBEPBE
basis: SDD
operation: Freq
keyword: #p
keyword: freq=noraman
keyword: PBEPBE/SDD
title: #p freq=noraman PBEPBE/SDD
converged: YES YES NO NO
title: Mulliken charges:
elementType: O O N N C C C C C C C C C C C C C C C C C C C C C C H H H H H H H H H H H H H H H H H H
charge: -0.264853 -0.248369 0.034893 -0.449789 0.239557 0.283093 0.239047 0.238802 -0.449706 -0.575795 -0.394744 -0.422322 -0.375013 0.534208 -0.490919 -0.229439 -0.269687 0.262573 -0.388398 -0.336832 0.204848 -0.331981 -0.354041 0.316052 -0.801761 -0.538232 0.355184 0.244709 0.245039 0.284970 0.219005 0.228600 0.231127 0.308893 0.255596 0.269999 0.241473 0.252670 0.235842 0.269959 0.236245 0.221152 0.245049 0.223298
chargesum: 0.00000
title: Mulliken charges with hydrogens summed into heavy atoms:
elementType: O O N N C C C C C C C C C C C C C C C C C C C C C C
charge: -0.264853 -0.248369 0.034893 -0.140896 0.239557 0.283093 0.239047 0.238802 -0.449706 -0.220611 -0.150035 -0.177283 -0.090043 0.534208 -0.271913 -0.000839 -0.038560 0.262573 -0.132802 -0.066833 0.204848 -0.090508 -0.101372 0.316052 -0.059716 0.151266
polarizability: 4.81621193e+02 2.16840430e+01 3.51314617e+02 1.66113431e+00 1.16065807e+01 1.32564816e+02
1716.lowfreq: -76.3884 -5.5716 -3.2271 -0.0003 0.0005 0.0008 4.7322 25.0252 32.9398
frequency: -76.3858 24.9977 32.9332 39.5555 56.5405 62.3602 77.9618 97.8168 110.4854 136.6232 143.9872 163.7500 166.7319 211.0740 221.2525 232.2490 255.9464 281.6695 319.2401 348.1650 356.2605 381.6266 411.4937 416.0837 424.2402 434.0717 454.5247 484.4729 517.1967 529.5815 532.8853 547.2960 560.7582 572.8764 603.9708 628.6728 640.6872 641.9115 661.7911 676.9155 694.2443 722.5945 733.2645 754.6782 756.7861 791.0691 810.0858 811.6299 817.2995 831.8614 835.5667 857.2520 893.7992 928.0808 938.2009 946.4425 953.7066 961.1646 964.4549 970.9609 985.3633 988.4997 991.2984 996.5546 1005.6455 1030.4783 1035.6464 1072.9184 1107.8213 1111.6268 1116.6440 1140.2496 1156.4304 1166.9734 1170.8601 1185.4237 1207.5537 1221.4594 1228.8135 1244.7801 1274.9352 1280.7112 1296.7595 1310.1807 1351.5762 1369.3205 1377.0510 1385.2828 1426.7182 1435.6819 1439.4926 1444.6968 1451.9487 1461.9155 1467.1212 1469.1756 1472.3468 1485.1758 1491.9065 1513.4604 1561.1371 1587.0660 1588.3359 1599.8206 1612.6186 1623.6882 1631.3646 1636.5917 2959.5372 2986.6725 3047.8109 3071.4501 3109.9811 3125.4819 3125.6345 3136.2528 3139.3066 3142.0169 3145.3026 3148.6618 3156.3211 3165.4808 3170.3758 3173.1655 3197.9565 3520.9161
redmass: 1.0554 4.5003 5.8017 4.9962 4.7911 4.1351 4.5700 4.4034 4.1662 4.3133 4.7294 6.0408 4.4530 3.6710 3.2014 2.1206 2.1885 4.0825 5.6867 4.3956 5.6705 5.0311 3.5348 3.6482 4.7834 4.5663 3.2081 3.9841 4.9830 5.2708 3.0560 4.5093 5.7101 3.0988 3.2318 6.6376 1.2436 5.4201 6.1827 3.8718 5.6920 4.2179 5.7396 1.4263 5.3593 2.8849 1.6668 2.8597 2.9559 1.7298 1.7720 5.9210 1.5467 6.4783 1.3614 1.4245 1.3804 2.4041 1.3988 1.4615 8.1519 3.0449 1.3439 2.6206 2.6960 1.6550 2.0130 3.3495 1.3427 1.2602 1.9224 1.6712 1.3316 1.3825 1.2558 1.5523 2.1646 2.3312 2.8103 3.3214 1.9464 1.7624 1.3097 2.1461 5.1660 5.7565 1.2686 3.9943 3.7762 1.2126 2.1271 1.9817 1.4972 3.8861 1.0501 1.0468 1.1163 2.7563 3.0161 1.9931 7.0571 6.5843 7.9824 6.9900 6.7274 7.3061 7.8415 5.5130 1.0329 1.0384 1.1040 1.0984 1.0885 1.0993 1.0860 1.0978 1.0908 1.0884 1.0953 1.0875 1.0957 1.0963 1.0969 1.0975 1.0935 1.0763
irintensity: 0.0141 2.8122 3.4806 1.0979 3.4194 7.4308 0.7070 5.5451 1.4759 4.8371 2.4287 4.0700 1.6818 0.6389 1.5848 2.5989 1.8973 0.5035 4.2086 1.2944 1.7648 4.5693 18.7788 1.5509 2.0834 4.3892 4.4538 21.7329 5.4532 4.7177 18.6483 2.8019 27.6831 3.0012 8.1189 2.7997 53.4869 8.7533 0.5147 2.2222 9.7136 0.2542 5.0874 95.2792 6.6357 10.5314 14.3652 9.4328 17.9363 56.5365 42.4836 18.5579 0.6502 5.3987 0.6973 0.4992 3.3429 23.0419 1.2146 26.1942 58.3743 22.2741 0.2432 18.4082 2.9212 7.4932 3.8249 4.8665 13.9654 0.2881 0.8965 3.8616 2.6145 8.3023 96.9511 6.8775 33.0856 111.1385 217.1089 99.7639 18.9688 16.6076 2.6161 26.8548 23.6347 63.8029 72.9122 89.2003 2.4615 27.2902 28.4391 105.8515 34.4661 156.4576 13.9099 19.5193 96.4057 136.5884 260.2378 182.2885 15.4335 4.8685 50.9149 64.0824 46.2787 27.4047 27.4119 115.8377 106.8295 11.4771 46.9926 15.9494 26.5505 31.5032 1.9913 6.5246 4.1249 8.8520 26.8278 9.5825 32.8372 7.7957 12.7063 16.6576 7.3988 12.5313
temp: 298.150 k
press: 1.00000 atm
elementType: 8 8 7 7 6 6 6 6 6 6 6 6 6 6 6 6 6 6 6 6 6 6 6 6 6 6 1 1 1 1 1 1 1 1 1 1 1 1 1 1 1 1 1 1
symmnumber: 1
zpe: 898199.6 jmol-1
zpe.correction: 0.342106 hartree
zpe.thermalcorrener: 0.363630 hartree
zpe.thermalcorrenthalpy: 0.364574 hartree
zpe.thermalcorrgfe: 0.290142 hartree
zpe.sumelectzpe: -1107.309825 hartree
zpe.sumelectthermal: -1107.288301 hartree
zpe.sumelectthermalent: -1107.287357 hartree
zpe.sumelectthermalfe: -1107.361789 hartree
dipole: 2.1980 1.6674 -0.8499
dipole: 2.8869
quadrupole: -91.9629 -140.9800 -153.6116
quadrupole: 7.7534 9.3209 4.9937
quadrupole: 36.8886 -12.1285 -24.7601 7.7534 9.3209 4.9937
hfenergy: -1107.6519313 hartree
pointgroup: C01 [X(C22H18N2O2)]
dipole: 0.7964626 -0.7717836 0.2449202 debye
polarizability: 476.2018192|-33.6432585|350.7434914|-4.0565493|37.9888815|138.5553158 unknown
InChI: InChI=1S/C22H18N2O2/c1-14(25)23-16-9-12-19-18-5-3-4-6-20(18)22(21(19)13-16)24-15-7-10-17(26-2)11-8-15/h3-13,23H,1-2H3
charge 0 multiplicity 1
44 atoms
O  -5.997477 2.14953 -0.198673
O  3.742523 2.969723 0.455438
N  -0.5711 0.625727 0.26516
N  4.884966 0.947956 0.095192
C  1.852009 -2.016718 -0.200345
C  1.494081 -0.652551 0.00628
C  0.61459 -2.820369 -0.243967
C  -0.513231 -1.944745 -0.091871
C  0.003722 -0.537279 0.063701
C  2.449051 0.370054 0.109082
C  3.209903 -2.370764 -0.310697
C  0.434632 -4.210966 -0.368922
C  -1.817045 -2.479432 -0.030886
C  3.821381 0.005197 0.002397
C  4.186913 -1.357257 -0.208006
C  -0.879976 -4.737563 -0.32534
C  -1.993698 -3.880988 -0.146958
C  -1.946581 0.924707 0.174061
C  -2.502681 1.79908 1.147285
C  -2.768872 0.525373 -0.925199
C  4.822722 2.330337 0.30758
C  -3.850094 2.206798 1.080831
C  -4.099228 0.961109 -1.021049
C  -4.654521 1.788073 -0.009904
C  6.196391 3.004096 0.345124
C  -6.607797 3.027098 0.802841
H  2.155287 1.408642 0.266626
H  3.518229 -3.40909 -0.47272
H  1.293068 -4.881519 -0.487232
H  -2.686175 -1.831552 0.108223
H  5.249299 -1.62199 -0.291806
H  -1.037289 -5.817752 -0.421753
H  -3.002828 -4.304506 -0.100737
H  5.823848 0.554426 -0.006289
H  -1.857548 2.144628 1.961093
H  -2.342011 -0.094393 -1.720909
H  -4.24992 2.859715 1.862401
H  -4.727879 0.679563 -1.871447
H  6.823207 2.596484 1.160144
H  6.051961 4.080321 0.515931
H  6.739172 2.866157 -0.60865
H  -6.612235 2.553604 1.804099
H  -7.641731 3.179193 0.460089
H  -6.08494 4.001838 0.855984
