program: Gaussian 09
title: 000229543
version: EM64L-G09RevD.01
frameworkgroup: C1[X(C20H12N4O6)]
method: RPBEPBE
basis: SDD
operation: Freq
keyword: #p
keyword: freq=noraman
keyword: PBEPBE/SDD
title: #p freq=noraman PBEPBE/SDD
converged: YES YES NO NO
title: Mulliken charges:
elementType: O O O O O O N N N N C C C C C C C C C C C C C C C C C C C C H H H H H H H H H H H H
charge: -0.169257 -0.201554 -0.185231 -0.186445 -0.192838 -0.200518 0.031706 0.010755 0.017155 0.022089 0.148069 0.295662 0.250222 0.268764 -0.439117 0.319990 -0.628252 -0.336982 -0.516938 0.468421 -0.540663 0.391522 -0.411994 0.285363 -0.545204 -0.392388 0.469509 -0.189678 -0.383600 -0.809635 0.345721 0.311371 0.339884 0.330952 0.296626 0.275842 0.263135 0.235805 0.241649 0.227728 0.230352 0.252003
chargesum: 0.00000
title: Mulliken charges with hydrogens summed into heavy atoms:
elementType: O O O O O O N N N N C C C C C C C C C C C C C C C C C C C C
charge: -0.169257 -0.201554 -0.185231 -0.186445 -0.192838 -0.200518 0.031706 0.010755 0.017155 0.022089 0.148069 0.295662 0.250222 0.268764 -0.439117 0.319990 -0.282530 -0.025611 -0.177054 0.468421 -0.209711 0.391522 -0.115368 0.285363 -0.269363 -0.129253 0.469509 0.046127 -0.141951 -0.099552
polarizability: 5.14786863e+02 -2.30071291e+01 3.82710975e+02 1.16843334e+00 2.03972292e+01 1.34818481e+02
1716.lowfreq: -6.1411 -1.1610 -0.0006 -0.0003 0.0004 3.0734 22.1539 28.1202 37.6316
frequency: 22.1344 28.1056 37.6180 42.9238 44.8020 49.7427 54.3099 71.8352 75.5915 106.7810 118.3388 130.0681 151.3107 169.5958 189.4619 205.5391 210.8284 222.1271 229.2953 253.3698 302.4295 316.2934 331.7298 348.0536 359.6337 392.5442 418.7326 434.0403 438.1792 465.7726 483.2510 507.3516 511.8017 525.8701 534.6008 548.8424 552.8677 572.0314 607.0900 626.2792 652.3629 666.1526 681.1234 694.6299 696.5898 708.1052 714.9683 721.3657 726.5080 746.2647 780.5171 789.3990 799.7666 803.1330 860.0824 869.1265 883.8879 885.2036 918.2124 933.1394 959.1617 960.0590 979.6092 982.6508 985.2124 987.2287 1000.0506 1006.0348 1014.6433 1049.0527 1064.3643 1079.5656 1093.2775 1116.5966 1141.6034 1165.5718 1177.9587 1185.5454 1204.4249 1207.5851 1212.4993 1227.8008 1243.6772 1269.3184 1283.2247 1302.2770 1356.8760 1370.3841 1371.8371 1380.1311 1395.8900 1399.2530 1400.4260 1412.9928 1428.9198 1439.2663 1445.6522 1468.9025 1471.7282 1475.0139 1482.0940 1565.0581 1578.0336 1581.5673 1591.5540 1603.7532 1613.6838 1619.3072 2980.8722 3063.7999 3091.2471 3130.3824 3132.7737 3152.1471 3172.9643 3182.3532 3187.1934 3189.7791 3190.3710 3206.0867
redmass: 9.3770 4.3114 6.0680 7.8329 9.7890 13.9985 11.8548 1.2151 3.4650 11.6615 7.9167 7.1867 5.5537 11.2197 5.1323 9.1518 3.3586 7.2580 8.0005 7.4824 5.3736 4.8682 11.0585 7.6874 6.4453 5.1603 4.3361 5.0452 3.9825 4.7306 7.8814 6.2188 5.4838 6.6604 6.5224 4.3668 6.1935 4.5969 7.6630 7.4408 6.1337 9.1698 6.5663 5.0001 2.5582 4.8089 7.2529 8.3065 8.6768 9.0724 7.6358 3.9686 3.1507 2.2681 6.8953 1.5305 5.6570 1.4750 1.4126 2.9944 1.4525 1.4568 1.5457 5.5504 1.7991 3.1870 1.4049 1.5813 4.6798 1.5578 2.0032 1.7372 1.5548 2.8999 1.9138 2.1636 1.1213 2.0032 11.6056 7.5790 5.1463 3.6724 3.2595 2.1275 2.2600 1.3452 4.8595 9.8524 7.0324 12.5232 6.4197 6.7575 1.3430 2.6028 2.8655 4.4812 5.0389 2.4206 1.1889 1.5084 2.2367 6.6942 9.0405 7.6619 6.2806 7.2579 8.3572 9.5257 1.0384 1.0957 1.0999 1.0903 1.0887 1.0925 1.0983 1.0909 1.0932 1.0922 1.0930 1.0952
irintensity: 0.2230 0.8310 0.4255 1.4373 0.0123 0.1389 0.9828 1.6217 2.5945 2.2253 2.6797 0.9007 1.6484 3.9323 1.3069 1.8884 8.2416 5.2576 2.2800 1.6727 8.1472 0.5497 1.4093 0.2339 0.8281 5.6336 4.1760 5.4347 5.6138 8.7012 1.7678 5.2750 0.5884 1.2815 1.0717 1.4710 1.1503 9.3878 0.8765 20.3166 2.3168 11.4880 31.5641 2.9037 12.8323 30.3105 6.4513 7.8272 17.9469 6.9015 43.5695 20.2594 6.3375 33.5580 2.9955 28.3291 10.2009 38.4839 7.7504 4.7636 5.1320 19.8242 24.5421 3.4128 0.3429 0.3949 0.8253 8.3651 6.1987 12.2396 2.2323 116.0740 14.0471 0.2090 7.1208 16.4879 3.2446 5.4771 422.7669 480.9074 111.2828 117.0661 12.1999 10.5903 30.4250 0.3491 56.6063 17.1453 5.2571 115.6874 154.9984 10.8909 15.0324 7.6834 23.2623 58.3788 0.2393 14.3623 2.8296 33.2443 103.1747 18.9805 9.8871 10.2661 14.7544 17.7143 70.1712 27.6550 20.9644 17.6739 13.6361 3.3346 6.2673 19.2524 18.2634 3.3948 9.9300 32.5009 6.3389 3.7821
temp: 298.150 k
press: 1.00000 atm
elementType: 8 8 8 8 8 8 7 7 7 7 6 6 6 6 6 6 6 6 6 6 6 6 6 6 6 6 6 6 6 6 1 1 1 1 1 1 1 1 1 1 1 1
symmnumber: 1
zpe: 755160.6 jmol-1
zpe.correction: 0.287625 hartree
zpe.thermalcorrener: 0.312420 hartree
zpe.thermalcorrenthalpy: 0.313365 hartree
zpe.thermalcorrgfe: 0.230031 hartree
zpe.sumelectzpe: -1437.372832 hartree
zpe.sumelectthermal: -1437.348037 hartree
zpe.sumelectthermalent: -1437.347093 hartree
zpe.sumelectthermalfe: -1437.430427 hartree
dipole: 4.2790 -1.8014 0.4759
dipole: 4.6671
quadrupole: -201.9705 -191.8437 -166.0731
quadrupole: -26.6052 5.4615 2.4964
quadrupole: -15.3414 -5.2146 20.5560 -26.6052 5.4615 2.4964
hfenergy: -1437.6604577 hartree
pointgroup: C01 [X(C20H12N4O6)]
dipole: -1.6536571 0.7852117 0.1426502 debye
polarizability: 512.7302555|-29.1888183|375.8096186|-9.8590312|-49.2315077|143.7764459 unknown
InChI: InChI=1S/C20H12N4O6/c1-11-3-2-4-12(7-11)21-20-16-8-13(22(25)26)5-6-15(16)19-17(20)9-14(23(27)28)10-18(19)24(29)30/h2-10H,1H3
charge 0 multiplicity 1
42 atoms
O  4.885403 -2.720714 0.118133
O  2.975585 -3.256445 1.234493
O  4.296082 3.460451 -0.727173
O  5.948557 1.924818 -0.374422
O  -3.701732 -4.382777 0.116789
O  -4.492879 -2.254188 -0.104904
N  -0.639097 1.838195 -0.449047
N  3.696631 -2.449194 0.532405
N  4.709088 2.2671 -0.467966
N  -3.532325 -3.107603 0.025957
C  1.746664 -0.830405 0.124315
C  0.487804 -1.618559 0.191225
C  1.383238 0.531037 -0.152457
C  -0.621761 -0.716288 -0.004224
C  -0.097406 0.668378 -0.204573
C  3.139366 -1.109438 0.209509
C  2.315154 1.558246 -0.337775
C  0.244771 -3.004142 0.345598
C  -1.940542 -1.197282 -0.071017
C  3.680242 1.213484 -0.262739
C  4.105199 -0.100721 0.000942
C  -2.141673 -2.585104 0.078802
C  -1.077046 -3.490195 0.287502
C  -2.004611 2.184353 -0.376324
C  -2.850913 1.797865 0.70583
C  -2.50521 3.064792 -1.37648
C  -4.19263 2.234118 0.773693
C  -3.851272 3.475983 -1.32921
C  -4.689463 3.067591 -0.266314
C  -5.093203 1.801003 1.916401
H  1.993215 2.582534 -0.540388
H  1.065554 -3.698184 0.522941
H  -2.79915 -0.5446 -0.236564
H  5.170928 -0.33825 0.048688
H  -1.29602 -4.554384 0.406068
H  -2.439956 1.186905 1.518277
H  -1.832498 3.394744 -2.173605
H  -4.244374 4.133214 -2.112057
H  -5.730277 3.409957 -0.229787
H  -4.509823 1.4611 2.789166
H  -5.753353 2.623073 2.244631
H  -5.743569 0.960734 1.60586
