program: Gaussian 09
title: 000229526
version: EM64L-G09RevD.01
frameworkgroup: C1[X(C6H13NO2)]
method: RPBEPBE
basis: SDD
operation: Freq
keyword: #p
keyword: freq=noraman
keyword: PBEPBE/SDD
title: #p freq=noraman PBEPBE/SDD
converged: YES YES NO NO
title: Mulliken charges:
elementType: O O N C C C C C C H H H H H H H H H H H H H
charge: -0.418553 -0.242227 -0.648152 0.238615 -0.390036 -0.358671 -0.693496 0.116834 -0.694925 0.216270 0.195791 0.200134 0.214507 0.238145 0.227677 0.203668 0.310234 0.264269 0.208218 0.219652 0.211438 0.380607
chargesum: 0.00000
title: Mulliken charges with hydrogens summed into heavy atoms:
elementType: O O N C C C C C C
charge: -0.037946 -0.242227 -0.073648 0.238615 0.022024 0.055970 -0.024006 0.116834 -0.055616
polarizability: 7.91553114e+01 -2.13946909e+00 7.73092634e+01 -4.07313280e-01 -1.34723384e+00 7.69751921e+01
1716.lowfreq: -15.5245 -6.9943 -0.0001 0.0005 0.0006 8.0361 54.7078 60.5150 87.6025
frequency: 54.6908 60.4999 87.5934 156.3869 197.8724 211.1045 230.2016 239.4859 257.5987 328.1041 346.2060 359.8409 444.9187 488.8938 497.7029 551.9030 603.6752 699.3920 731.2923 744.4113 843.4132 876.2673 917.2467 958.7662 1011.4052 1043.5469 1058.6544 1061.7297 1111.4009 1127.1338 1208.5406 1221.2009 1257.6463 1274.1475 1303.5254 1336.0938 1352.5505 1383.0362 1389.1114 1450.2317 1467.4731 1471.3521 1473.8955 1477.7288 1485.2447 1595.6328 1657.6014 2965.6339 2972.1626 2974.8273 2991.1853 3016.7712 3044.2706 3069.3441 3072.9977 3088.8857 3113.4667 3488.8944 3516.9023 3632.0658
redmass: 6.9038 1.8583 3.1493 2.6976 1.3662 1.0632 1.2464 1.6014 3.6368 2.3313 3.0617 3.4547 1.4692 2.6992 3.4110 3.1655 1.2900 3.4329 2.4673 1.5239 1.7227 1.4741 2.1780 1.8246 1.4783 2.5087 2.1444 1.5893 2.0720 2.5934 2.2141 1.7672 1.5338 1.3880 1.2453 2.0054 1.6000 1.2373 1.2139 1.0756 1.0643 1.0616 1.0706 1.0457 1.0743 1.3200 3.8110 1.0607 1.0372 1.0594 1.0358 1.0981 1.1013 1.1010 1.0993 1.0984 1.1013 1.0445 1.0640 1.1003
irintensity: 0.8637 0.4005 0.2111 0.3151 29.7688 4.9661 3.5436 5.2920 1.9849 4.6948 9.5416 15.3594 187.8006 71.0900 36.8872 10.2011 171.0616 15.0378 14.9623 17.5023 3.6082 3.1201 2.5189 5.7956 25.1026 160.1462 14.2419 75.9599 6.8340 20.9469 2.4400 2.6635 9.6602 3.2431 4.4844 5.6730 10.2272 6.7645 11.6092 0.7271 7.2866 3.6699 21.9836 6.7392 11.8602 139.0602 146.9824 5.2030 36.3267 49.0901 27.0674 2.6978 13.7014 75.7045 47.1444 31.6040 23.1504 9.9286 27.3187 11.8130
temp: 298.150 k
press: 1.00000 atm
elementType: 8 8 7 6 6 6 6 6 6 1 1 1 1 1 1 1 1 1 1 1 1 1
symmnumber: 1
zpe: 490790.5 jmol-1
zpe.correction: 0.186932 hartree
zpe.thermalcorrener: 0.198411 hartree
zpe.thermalcorrenthalpy: 0.199355 hartree
zpe.thermalcorrgfe: 0.150062 hartree
zpe.sumelectzpe: -440.895588 hartree
zpe.sumelectthermal: -440.884110 hartree
zpe.sumelectthermalent: -440.883166 hartree
zpe.sumelectthermalfe: -440.932459 hartree
dipole: -1.5176 0.2929 -1.2650
dipole: 1.9973
quadrupole: -57.5151 -51.9324 -58.0290
quadrupole: -3.0709 -4.7790 4.2045
quadrupole: -1.6896 3.8931 -2.2035 -3.0709 -4.7790 4.2045
hfenergy: -441.0825206 hartree
pointgroup: C01 [X(C6H13N1O2)]
dipole: 0.6130969 -0.0487877 -0.4891128 debye
dipolederiv: -0.4367676 0.0513295 -0.1750925 0.0821643 -0.5158304 0.4350004 -0.1890602 0.3677515 -0.9030919 -0.393729 0.1585298 0.1501629 0.1956417 -0.6068918 -0.2763071 0.0539059 -0.0166516 -0.8947438 -0.7607416 -0.2858411 0.0882372 -0.2672997 -0.4443902 0.196886 0.0678747 0.097359 -0.6049644 0.2462169 0.2115287 0.0707771 0.212343 0.069503 -0.1656486 0.0155013 -0.2746352 0.4527576 0.0044757 -0.1338673 0.032508 -0.0023079 0.0304322 -0.0232144 -0.0233786 0.0297661 0.0092321 -0.0081022 -0.0437473 0.0013005 -0.0359365 0.1150202 -0.0440254 0.0717052 -0.0138961 0.0791466 -0.0484749 -0.0227922 -0.0598054 -0.0517531 0.0239308 -0.0641403 -0.0415156 0.0397434 -0.0227413 0.4040998 -0.3926469 -0.0525869 -0.5039628 0.950392 0.0043632 0.0300916 -0.1456044 1.3854173 -0.0429452 -0.0186389 0.0235326 -0.043334 0.0844703 -0.0065033 -0.0149099 -0.0135648 0.0828138 0.0467568 -0.0209151 0.0041152 -0.0251515 0.0356237 0.0846545 -0.0008546 0.0556764 -0.1307688 -0.0081301 0.0959262 0.0215207 0.0642467 -0.1510274 -0.0401023 0.0045764 -0.0235625 0.0648887 0.0656928 -0.0048507 0.035047 0.0076216 0.0467743 0.0853432 -0.0092459 0.0475133 -0.1459068 -0.0086248 0.0931732 0.0085789 0.0802967 -0.1385851 -0.0280958 -0.0030922 -0.0086407 0.0614911 -0.1337773 -0.0610533 0.0266847 -0.0338543 0.0835941 -0.0116208 0.0648048 -0.0015915 0.0682669 0.0963766 -0.0139329 0.011858 -0.0069877 0.0585772 0.0954746 -0.0107166 0.0620745 -0.1007689 0.0361939 0.121665 0.0038885 0.0837642 -0.1231616 -0.0417749 -0.0129227 -0.0267803 0.0770564 0.3330947 0.0033743 -0.1144172 0.0062963 0.1934271 -0.1028464 -0.0585398 -0.0327004 0.145084 0.2378326 0.2228642 -0.0394407 0.1580709 0.1887823 -0.0211326 0.0116883 -0.0124745 0.1593622 0.0259891 0.0599344 0.0111924 0.133253 -0.1433104 -0.005197 0.0234315 0.003503 0.0856416 -0.0711716 -0.0938095 -0.0718684 -0.123909 0.0056472 -0.0876631 -0.1108531 -0.0983645 0.0024334 0.0610008 0.0067282 -0.0107422 -0.0062404 0.0564566 0.0851768 0.0615133 0.0962045 -0.1441995 0.3547345 0.0670417 0.0345495 0.0770386 0.180566 -0.0686265 0.069996 -0.1311252 0.2735938 unknown
polarizability: 79.324129|-2.1062853|76.9077847|0.2306859|1.3087358|77.2078532 unknown
InChI: InChI=1S/C6H13NO2/c1-3-4-6(2,7)5(8)9/h8H,3-4,7H2,1-2H3
charge 0 multiplicity 1
22 atoms
O  -1.308162 1.31292 -1.110321
O  -1.368905 1.241316 1.203024
N  -0.529127 -1.359825 1.269445
C  -0.452279 -0.704612 -0.04486
C  1.025749 -0.486173 -0.557168
C  1.912876 0.380883 0.360808
C  -1.233249 -1.541556 -1.095118
C  -1.092583 0.679477 0.119179
C  3.380803 0.42204 -0.116372
H  0.992014 -0.045997 -1.572301
H  1.474064 -1.496955 -0.656731
H  1.866951 -0.014176 1.395161
H  1.512865 1.41372 0.40351
H  -2.274073 -1.68728 -0.76205
H  -1.228616 -1.057282 -2.085654
H  -0.761335 -2.537729 -1.181804
H  -0.568204 -0.729429 2.073577
H  0.065761 -2.181655 1.382586
H  3.824805 -0.591552 -0.126658
H  4.000286 1.055274 0.544778
H  3.455561 0.830054 -1.142085
H  -1.694703 2.214936 -0.943445
