program: Gaussian 09
title: 000229523
version: EM64L-G09RevD.01
frameworkgroup: C1[X(C23H22N2)]
method: RPBEPBE
basis: SDD
operation: Freq
keyword: #pfreq=noraman
keyword: PBEPBE/SDD
title: #p freq=noraman PBEPBE/SDD
converged: YES YES NO NO
title: Mulliken charges:
elementType: N N C C C C C C C C C C C C C C C C C C C C C C C H H H H H H H H H H H H H H H H H H H H H H
charge: -0.132078 -0.075101 -0.423089 -0.402414 0.080255 -0.500464 0.444771 0.522966 -0.430360 -0.459153 -0.386975 -0.332482 0.232029 -0.227758 -0.230707 -0.239563 -0.241872 -0.333631 -0.398518 -0.246891 -0.244672 -0.422112 -0.346987 0.436752 -0.812328 0.239441 0.254905 0.254693 0.246734 0.221911 0.230516 0.223971 0.274117 0.244664 0.225083 0.221598 0.225229 0.221249 0.263075 0.240027 0.228264 0.224685 0.226716 0.225485 0.223672 0.222154 0.232193
chargesum: 0.00000
title: Mulliken charges with hydrogens summed into heavy atoms:
elementType: N N C C C C C C C C C C C C C C C C C C C C C C C
charge: -0.132078 -0.075101 0.071256 0.099014 0.080255 -0.278553 0.444771 0.522966 -0.199844 -0.235182 -0.112858 -0.087818 0.232029 -0.002675 -0.009109 -0.014334 -0.020624 -0.070556 -0.158490 -0.018627 -0.019987 -0.195396 -0.121502 0.436752 -0.134309
polarizability: 3.22442348e+02 -1.43450237e+01 2.35142552e+02 2.35466169e+01 9.19157354e+00 2.41943563e+02
1716.lowfreq: -7.0476 -0.0009 -0.0005 0.0008 1.5907 6.9797 18.4207 25.3813 30.3619
frequency: 16.9177 25.3553 30.3492 32.6642 39.4591 41.3887 56.0218 70.2546 78.5001 112.0052 125.8068 159.2642 174.0923 207.7091 212.2550 225.1804 250.7952 278.8632 303.2149 328.8088 349.6211 401.3738 402.8074 405.2700 410.5779 471.3464 483.5662 508.4170 511.7620 569.7504 604.8500 615.9869 618.5490 630.5228 641.7516 687.3085 698.8455 701.6269 709.7444 720.3884 751.3184 755.8720 796.3264 801.0560 807.9324 828.3486 837.8236 842.7705 846.7857 859.6368 867.1533 900.3578 914.3159 931.9898 946.2634 955.2506 965.3215 967.2217 984.5170 985.2210 989.0178 990.5528 991.8109 996.9698 1003.2494 1007.7493 1027.4561 1028.2769 1044.8730 1076.5910 1080.6314 1086.2265 1101.1692 1105.1937 1117.1133 1117.7396 1136.7010 1170.2857 1171.1159 1178.1523 1183.4470 1187.9907 1191.5436 1200.9411 1221.1310 1229.2749 1253.4807 1286.1672 1301.4040 1329.2757 1337.0634 1351.2323 1357.2261 1381.6335 1387.8064 1397.5255 1414.4146 1439.9956 1442.6054 1459.3303 1470.8998 1474.3143 1475.1918 1478.5978 1482.0780 1496.3034 1564.4656 1589.9123 1594.4825 1606.2116 1608.5611 1613.9018 1626.7323 2971.1237 3007.4712 3048.3474 3071.3037 3079.2565 3080.8315 3110.6238 3114.4572 3114.8576 3116.8537 3123.6692 3124.3577 3136.5960 3137.7616 3146.4881 3148.5701 3153.4592 3155.4740 3161.8268 3171.5687 3174.7325 3191.4788
redmass: 4.3992 4.1956 1.5285 1.8785 4.0149 3.9950 4.5081 4.5026 4.0397 2.7974 4.4300 3.9914 3.8903 4.3107 4.2760 4.6179 4.4569 4.6467 3.5404 4.3125 3.9646 3.8872 2.7934 2.8682 3.1313 4.5662 3.9297 3.6563 3.1297 5.4310 5.6442 6.4048 6.3581 5.1017 6.0490 5.6375 2.2475 2.9019 1.8261 3.2218 2.6862 1.9473 2.5003 1.3694 2.3767 1.8011 1.2850 1.3579 3.2273 1.2775 3.4160 4.9439 1.6912 1.5465 1.3704 2.8304 1.3637 1.3942 1.3880 1.4306 1.7737 3.0812 4.1539 1.1719 1.3228 2.6959 2.2710 2.1730 1.5322 1.6179 1.4438 1.5950 1.4765 1.5343 1.4112 1.6835 1.4778 1.0807 1.0854 2.0618 1.2180 1.1708 1.1228 2.2667 2.4535 5.3628 1.6051 1.6520 1.3314 1.4708 1.4121 3.8861 2.8067 6.8544 5.6941 1.2324 3.5269 2.2066 2.1003 1.0768 1.0525 1.1232 1.2687 1.9951 2.2532 2.6245 5.7806 6.2116 6.0405 6.8761 6.3572 6.3790 7.5116 1.0377 1.0832 1.0967 1.0492 1.0987 1.0589 1.0870 1.0887 1.0867 1.0884 1.0864 1.0868 1.0917 1.0929 1.0955 1.0948 1.0958 1.0977 1.1014 1.0968 1.1187 1.1176
irintensity: 0.9843 0.4093 0.5391 0.0291 0.0641 0.0681 0.3107 1.0129 2.2369 1.0605 2.0211 1.4958 3.6100 5.1055 4.0956 2.0170 0.1987 0.8507 1.6111 4.1403 3.1327 5.8104 0.3635 0.1719 3.0690 0.9097 9.4601 10.8440 19.4960 5.5760 11.8557 0.6086 3.3715 24.0673 11.9861 7.6510 25.9622 31.7121 55.8276 3.2164 47.8599 22.5119 6.6009 16.9596 22.8342 35.1476 2.7619 1.0201 8.3475 0.2045 2.1335 6.9120 2.9106 3.2278 3.3746 7.0825 0.0341 0.2146 0.0186 2.8488 0.2823 0.2464 1.1495 3.5140 1.0239 3.0750 8.7119 10.5328 15.5684 9.4293 31.3007 17.6750 31.4376 8.7740 5.5333 57.0086 5.7637 0.1463 0.0706 1.1427 0.7903 3.8213 2.0701 0.4106 2.9648 8.8643 2.9669 20.9294 0.5821 20.5104 20.9781 24.0834 111.3899 1.7355 1.3416 4.5290 0.4495 12.3125 4.4450 1.6897 11.7244 2.6050 24.5997 40.5925 16.6191 80.6852 10.0107 14.8027 0.7192 210.2556 46.1780 32.4589 101.2792 60.5311 13.5289 23.7550 27.4721 19.4825 23.9307 7.9563 17.0876 5.8636 35.2587 0.7626 1.0181 14.1702 33.0127 20.9311 20.9550 0.0733 46.6458 35.5104 6.4760 1.6503 21.2951
temp: 298.150 k
press: 1.00000 atm
elementType: 7 7 6 6 6 6 6 6 6 6 6 6 6 6 6 6 6 6 6 6 6 6 6 6 6 1 1 1 1 1 1 1 1 1 1 1 1 1 1 1 1 1 1 1 1 1 1
symmnumber: 1
zpe: 1003999.3 jmol-1
zpe.correction: 0.382403 hartree
zpe.thermalcorrener: 0.404898 hartree
zpe.thermalcorrenthalpy: 0.405842 hartree
zpe.thermalcorrgfe: 0.326712 hartree
zpe.sumelectzpe: -997.342273 hartree
zpe.sumelectthermal: -997.319778 hartree
zpe.sumelectthermalent: -997.318834 hartree
zpe.sumelectthermalfe: -997.397963 hartree
dipole: 0.0281 -2.6594 1.5029
dipole: 3.0548
quadrupole: -137.2402 -141.1380 -132.4456
quadrupole: -0.5231 2.8980 -0.1524
quadrupole: -0.2989 -4.1967 4.4957 -0.5231 2.8980 -0.1524
hfenergy: -997.7246757 hartree
pointgroup: C01 [X(C23H22N2)]
dipole: -0.2226945 0.3727026 -1.1206759 debye
polarizability: 312.266292|13.8134297|249.7590134|-37.207416|-4.4291042|237.5031572 unknown
InChI: InChI=1S/C23H22N2/c1-18-12-14-21(15-13-18)24-23(25-16-17-25)22(19-8-4-2-5-9-19)20-10-6-3-7-11-20/h2-15,22H,16-17H2,1H3
charge 0 multiplicity 1
47 atoms
N  -0.539358 -0.799047 -2.053317
N  -0.749467 -0.277353 0.309119
C  -0.28493 -0.091641 -3.342014
C  -1.69958 -0.196353 -2.757211
C  -0.043146 -0.423311 -0.782833
C  1.485501 -0.23508 -0.750856
C  1.874893 1.250712 -0.882663
C  2.135254 -0.9209 0.459958
C  3.035757 1.59245 -1.624082
C  2.816224 -2.14962 0.273255
C  1.133405 2.289219 -0.263359
C  2.06888 -0.367464 1.762621
C  -2.131829 -0.549841 0.461113
C  3.44983 2.937228 -1.744568
C  3.420657 -2.816663 1.363266
C  1.54472 3.636034 -0.385686
C  2.671503 -1.031327 2.852966
C  -2.792344 -1.670149 -0.123348
C  -2.876326 0.279911 1.347312
C  2.703469 3.966683 -1.124801
C  3.350551 -2.257332 2.658923
C  -4.147815 -1.932748 0.169359
C  -4.235185 0.022096 1.6074
C  -4.900904 -1.091468 1.026712
C  -6.35766 -1.3827 1.344553
H  -0.006599 -0.728225 -4.188265
H  0.211005 0.886101 -3.301742
H  -2.140813 0.710018 -2.325929
H  -2.418526 -0.902012 -3.185824
H  1.869872 -0.7500 -1.65207
H  3.622989 0.797228 -2.100526
H  2.869879 -2.590734 -0.730461
H  0.234118 2.034581 0.307985
H  1.540161 0.57623 1.92246
H  4.350387 3.181731 -2.319438
H  3.943565 -3.76623 1.201323
H  0.960588 4.427326 0.098322
H  2.61062 -0.593543 3.85592
H  -2.23214 -2.345003 -0.779102
H  -2.36169 1.119587 1.826718
H  3.021293 5.011297 -1.217422
H  3.81881 -2.769623 3.507173
H  -4.630814 -2.809695 -0.280024
H  -4.787961 0.685769 2.284522
H  -6.985436 -0.478497 1.23751
H  -6.76916 -2.160841 0.678257
H  -6.478746 -1.739705 2.385893
