program: Gaussian 09
title: 000229517
version: EM64L-G09RevD.01
frameworkgroup: C1[X(C13H18N2O2)]
method: RPBEPBE
basis: SDD
operation: Freq
keyword: #p
keyword: freq=noraman
keyword: PBEPBE/SDD
title: #p freq=noraman PBEPBE/SDD
converged: YES YES NO NO
title: Mulliken charges:
elementType: O O N N C C C C C C C C C C C C C H H H H H H H H H H H H H H H H H H
charge: -0.269850 -0.263684 -0.380773 -0.504998 -0.199216 -0.453317 -0.437631 0.326608 -0.549888 0.299647 -0.579976 -0.560888 -0.395620 0.318443 0.214180 -0.391500 -0.535811 0.266680 0.217710 0.210096 0.198868 0.208634 0.219020 0.220907 0.259917 0.220227 0.264505 0.227700 0.239670 0.319513 0.217778 0.219370 0.243545 0.305354 0.304779
chargesum: 0.00000
title: Mulliken charges with hydrogens summed into heavy atoms:
elementType: O O N N C C C C C C C C C C C C C
charge: -0.269850 -0.263684 -0.061260 0.105135 0.067464 -0.025511 -0.030129 0.326608 -0.109960 0.299647 -0.099832 -0.296383 -0.167920 0.318443 0.214180 -0.151829 0.144882
polarizability: 2.12877232e+02 1.11440174e+01 1.61470176e+02 8.20473944e+00 -8.53528522e+00 1.08219399e+02
1716.lowfreq: -9.0071 -0.0005 -0.0003 0.0001 1.9037 5.7620 23.1133 32.7353 62.1987
frequency: 23.0596 32.7169 62.1898 65.7720 100.2380 125.2146 138.8419 150.0998 179.5519 205.4910 226.6064 232.7829 266.2554 274.8264 312.0722 343.6384 370.3668 392.4644 396.1759 455.4979 484.3549 505.4860 542.6462 559.7530 591.9627 624.7217 639.3026 689.5392 701.8719 725.9270 769.2766 784.4768 802.0840 828.7389 854.2546 881.0309 892.8580 904.2564 931.2652 942.3697 951.6403 972.9473 1005.4194 1023.6599 1065.1032 1102.8739 1111.8082 1113.0661 1126.5753 1142.3866 1158.9281 1168.1564 1177.1969 1198.2015 1210.5267 1230.2527 1248.8855 1258.0865 1275.6653 1283.1408 1285.9751 1325.0627 1330.6219 1334.6244 1344.5849 1360.2355 1383.4143 1421.0059 1436.4620 1437.1244 1447.9306 1457.5982 1465.8787 1472.2217 1473.8793 1475.9453 1496.4127 1580.0097 1615.2004 1624.0967 1679.6596 2953.6000 2955.4147 2978.6721 2980.8719 2989.5115 3003.1762 3017.0120 3037.6220 3041.2143 3044.1514 3051.1586 3112.2258 3121.4412 3133.8841 3160.7850 3390.4697 3504.5760 3549.7756
redmass: 5.4208 4.8912 3.5435 3.6506 3.4973 3.0226 1.5784 2.4082 3.9493 2.6204 1.7953 1.9332 2.9432 2.3921 3.8540 3.0294 2.3826 3.8010 3.4452 3.0074 3.1222 3.5911 1.7592 3.6437 2.2395 3.0183 2.7173 3.5392 4.7144 3.2190 2.3930 2.2875 1.4463 2.8930 1.5567 3.0592 1.6086 2.4672 1.5010 2.9198 2.4625 2.3981 4.6186 2.4420 1.9251 1.7310 1.2636 1.8292 1.8097 1.5481 1.4675 1.4261 1.4347 1.6819 2.0739 1.6516 1.9768 1.5917 1.2746 1.5813 1.1957 1.5714 1.4567 1.5581 1.4191 1.6305 4.9601 3.2787 1.2853 1.5770 1.1208 1.1195 1.0505 1.0856 1.0740 1.0913 2.5674 7.1768 7.0749 6.8479 1.0635 1.0636 1.0342 1.0645 1.0628 1.0620 1.0801 1.0941 1.0978 1.1038 1.1029 1.1005 1.0890 1.0991 1.0913 1.0936 1.0428 1.0985 1.0796
irintensity: 1.4145 1.6797 2.0969 0.6997 5.0148 8.3894 8.4951 4.4365 0.3516 13.8858 2.4807 3.3692 18.4440 2.9282 2.6317 8.9584 3.5651 1.3871 7.1154 8.1262 4.2216 16.9353 71.3789 21.1554 38.9958 12.7006 7.0117 12.3717 0.3807 7.7342 47.5434 105.1221 24.9818 0.9345 11.8219 3.9522 13.3065 4.3099 1.0809 12.7383 15.3536 8.8316 64.9300 2.7898 0.2610 1.4088 0.3452 8.3623 31.0730 13.8641 0.4512 10.6108 27.7091 8.3655 14.1623 17.8943 123.5099 26.8368 20.3002 12.2039 1.2125 9.1945 21.8614 1.7205 2.1756 1.2925 9.7301 25.8070 38.6175 130.2557 9.2628 8.5019 12.8496 14.3725 48.0808 9.6366 103.1435 22.6130 147.9487 79.4771 26.5304 33.9468 76.6444 25.5333 29.3863 9.0680 18.8973 37.4364 57.8056 50.3257 65.7546 21.2009 23.1251 22.5781 4.0044 17.4363 0.2378 1.5645 29.1594
temp: 298.150 k
press: 1.00000 atm
elementType: 8 8 7 7 6 6 6 6 6 6 6 6 6 6 6 6 6 1 1 1 1 1 1 1 1 1 1 1 1 1 1 1 1 1 1
symmnumber: 1
zpe: 767452.7 jmol-1
zpe.correction: 0.292307 hartree
zpe.thermalcorrener: 0.309193 hartree
zpe.thermalcorrenthalpy: 0.310137 hartree
zpe.thermalcorrgfe: 0.246552 hartree
zpe.sumelectzpe: -764.827942 hartree
zpe.sumelectthermal: -764.811056 hartree
zpe.sumelectthermalent: -764.810112 hartree
zpe.sumelectthermalfe: -764.873698 hartree
dipole: -1.6542 1.9795 -2.3615
dipole: 3.4973
quadrupole: -85.6550 -99.4142 -104.8221
quadrupole: 3.8563 0.2091 3.7812
quadrupole: 10.9754 -2.7838 -8.1916 3.8563 0.2091 3.7812
hfenergy: -765.1202494 hartree
pointgroup: C01 [X(C13H18N2O2)]
dipole: 0.67701 -0.7598051 -0.926074 debye
polarizability: 213.6162893|10.2747664|160.6253696|-3.6725921|10.5972702|108.3251478 unknown
InChI: InChI=1S/C13H18N2O2/c1-17-11-6-5-9-3-2-4-10(12(9)8-11)7-13(16)15-14/h5-6,8,10,15H,2-4,7,14H2,1H3
charge 0 multiplicity 1
35 atoms
O  3.545258 1.977526 0.233803
O  -3.253342 1.663868 0.942553
N  -3.974072 0.889372 -1.122737
N  -5.332746 1.263344 -0.934583
C  -0.878967 -0.135542 0.555504
C  -1.568087 -1.505782 0.778871
C  -1.174833 -2.528992 -0.309304
C  0.615797 -0.288217 0.251075
C  0.34237 -2.806964 -0.246972
C  1.178443 -1.531902 -0.16494
C  -1.575292 0.684411 -0.577351
C  1.450596 0.846576 0.366774
C  2.560868 -1.580416 -0.463477
C  2.830081 0.776562 0.071198
C  -2.984041 1.120271 -0.171489
C  3.398189 -0.449252 -0.355596
C  4.981743 1.947903 -0.043947
H  -0.996284 0.471134 1.474736
H  -2.665425 -1.368765 0.815277
H  -1.26641 -1.905102 1.767673
H  -1.445957 -2.142152 -1.312054
H  -1.735785 -3.472215 -0.169446
H  0.662089 -3.410544 -1.118636
H  0.548995 -3.428717 0.649966
H  -0.986344 1.601673 -0.766856
H  -1.585627 0.109787 -1.52357
H  1.042673 1.807629 0.701624
H  2.99902 -2.533005 -0.788337
H  4.461751 -0.533091 -0.597974
H  -3.759931 0.447129 -2.017735
H  5.184713 1.682234 -1.100247
H  5.508402 1.236974 0.622807
H  5.334028 2.971057 0.154043
H  -5.724496 0.775855 -0.115712
H  -5.406277 2.28285 -0.803739
