program: Gaussian 09
title: 000021726
version: EM64L-G09RevD.01
frameworkgroup: C1[X(C19H22N2S)]
method: RPBEPBE
basis: SDD
operation: Freq
keyword: #p
keyword: freq=noraman
keyword: PBEPBE/SDD
title: #p freq=noraman PBEPBE/SDD
converged: YES YES NO NO
title: Mulliken charges:
elementType: S N N C C C C C C C C C C C C C C C C C C C H H H H H H H H H H H H H H H H H H H H H H
charge: 0.172063 -0.408156 -0.332566 -0.564149 0.397936 -0.033554 0.111171 0.233365 -0.437947 -0.746589 -0.409334 -0.342373 -0.253279 -0.199748 -0.637042 -0.815263 0.495630 -0.378772 -0.376820 -0.220596 -0.220593 -0.238581 0.221829 0.218433 0.202208 0.269933 0.304831 0.207261 0.218523 0.240233 0.260756 0.264892 0.229416 0.245764 0.226092 0.219628 0.191010 0.270732 0.267560 0.234118 0.234053 0.225178 0.224914 0.227832
chargesum: 0.00000
title: Mulliken charges with hydrogens summed into heavy atoms:
elementType: S N N C C C C C C C C C C C C C C C C C C C
charge: 0.172063 -0.103325 -0.067673 -0.123887 0.397936 0.168654 0.111171 0.233365 -0.168014 -0.080571 -0.148578 -0.112957 -0.253279 0.046016 -0.000312 -0.276970 0.495630 -0.144654 -0.142767 0.004582 0.004321 -0.010749
polarizability: 3.54373745e+02 -1.72405764e+01 2.50242415e+02 1.02255205e+01 -1.36203281e+01 1.39156279e+02
1716.lowfreq: -8.2627 -1.8217 -0.0016 -0.0008 -0.0007 4.6874 12.5926 19.7658 24.0378
frequency: 12.4991 19.4805 23.8879 31.3836 37.6896 44.7390 73.1572 90.6720 101.5766 144.3572 151.9545 190.2419 200.0979 212.2876 232.4910 251.1738 280.2333 300.0307 328.0306 342.1795 368.5447 384.2121 402.4805 412.8049 427.7066 459.3556 470.5483 483.9862 509.6158 551.3800 565.5426 589.1790 604.8026 617.0053 627.9980 645.4052 667.8882 700.6248 746.9469 765.0416 774.4992 778.8395 791.8610 804.2801 813.3274 837.6043 850.5649 872.9175 887.9820 888.5544 900.0616 921.0155 924.0323 941.5891 975.5598 989.5994 994.4343 1026.4144 1031.0038 1045.2145 1057.6577 1068.0054 1073.2816 1088.0081 1093.7806 1107.4319 1118.9632 1139.6030 1153.3397 1172.1092 1186.7942 1205.9206 1208.6636 1219.5325 1231.1458 1235.6774 1248.5555 1276.3612 1284.4597 1308.8789 1324.4854 1332.9235 1342.1107 1381.0744 1384.8233 1387.0484 1413.0584 1437.3710 1439.9049 1443.5790 1447.8071 1455.5802 1458.5291 1461.1403 1465.1945 1477.1180 1478.8903 1483.5829 1495.7876 1559.2957 1575.4838 1593.0057 1613.0505 1621.5616 2845.9169 2865.2306 2973.7240 2984.1715 3015.8893 3028.9037 3045.0303 3063.7684 3074.9247 3091.5687 3102.9530 3119.9248 3122.5349 3130.7820 3135.3467 3145.4112 3146.5355 3156.6663 3163.4995 3219.8347 3457.0842 3612.9006
redmass: 5.4086 3.5916 3.2568 3.9290 4.0523 4.9902 4.1808 5.1044 1.9190 5.5440 3.6554 2.6433 1.5783 1.2434 4.9957 2.5181 3.1563 3.8027 2.3184 4.0774 7.1138 2.7695 2.7992 3.6295 2.8776 2.3773 3.8456 3.3839 1.2277 5.6427 4.0759 2.9127 1.8461 6.3355 3.6824 4.3487 4.7427 1.6586 4.4364 4.5354 2.3156 3.4401 1.5946 2.2700 2.0878 2.1932 1.2506 2.9574 1.6549 1.7395 1.4582 1.7456 1.4648 1.3301 1.3916 5.5676 1.3514 2.1889 1.8051 2.1102 2.3392 1.4563 1.6814 2.8563 1.5203 1.3604 1.1116 1.3333 3.4283 1.0518 1.1119 1.5816 1.9175 1.6514 1.7551 2.0440 1.3955 1.5945 1.8884 1.9376 1.2796 1.3699 1.3686 1.2884 8.6578 5.7625 2.1551 1.1667 2.2326 3.6619 1.2666 3.8351 1.1225 1.1386 1.0548 1.0710 1.0597 2.3691 1.0478 6.6518 6.2918 6.1029 6.1486 6.9936 1.0812 1.0572 1.0365 1.0606 1.0744 1.0571 1.1005 1.0991 1.0990 1.0983 1.1092 1.0848 1.0879 1.0880 1.0920 1.0922 1.0964 1.0967 1.1017 1.0983 1.0749 1.0809
irintensity: 0.1757 0.0973 0.1369 0.2656 0.7089 1.6492 1.3725 0.2153 1.1853 4.1310 0.4361 0.9668 1.3345 1.3921 1.0071 0.5761 1.5681 1.9861 0.3009 2.9007 2.8314 22.4874 0.0218 2.5877 11.3937 1.6145 7.0609 4.4984 88.0841 6.3551 26.2972 28.5318 114.3034 0.0367 23.4033 5.2845 0.6154 55.0742 0.8451 3.9168 39.1703 2.5533 50.7645 22.8535 4.8306 4.8794 0.0355 7.5485 5.1939 4.3265 8.6611 0.9193 2.1444 0.5000 0.0246 0.0952 0.0722 8.8500 2.6971 3.0779 10.3742 6.2760 15.9271 1.4818 53.8571 0.2658 4.4063 1.8969 34.2407 0.0412 0.9505 0.7429 18.0770 1.6428 5.9323 6.6630 4.6694 2.3854 16.9412 12.5092 0.1306 1.7423 26.3128 24.3985 1.3150 44.2032 6.8547 4.4589 5.8184 15.6283 17.1279 38.3029 2.6133 10.9785 4.0632 6.5514 9.4093 18.6172 18.3274 1.1592 1.1464 1.2399 5.6415 1.7258 77.2184 126.7359 37.0490 29.5668 49.1870 19.1204 20.9311 38.1032 44.6547 30.0644 6.5662 7.1211 1.0479 8.9425 16.1462 5.3844 44.2563 11.4589 28.5453 1.8851 0.9703 70.8669
temp: 298.150 k
press: 1.00000 atm
elementType: 16 7 7 6 6 6 6 6 6 6 6 6 6 6 6 6 6 6 6 6 6 6 1 1 1 1 1 1 1 1 1 1 1 1 1 1 1 1 1 1 1 1 1 1
symmnumber: 1
zpe: 952058.6 jmol-1
zpe.correction: 0.362620 hartree
zpe.thermalcorrener: 0.384317 hartree
zpe.thermalcorrenthalpy: 0.385261 hartree
zpe.thermalcorrgfe: 0.307566 hartree
zpe.sumelectzpe: -1243.185359 hartree
zpe.sumelectthermal: -1243.163662 hartree
zpe.sumelectthermalent: -1243.162718 hartree
zpe.sumelectthermalfe: -1243.240413 hartree
dipole: 1.9338 -0.9372 2.8132
dipole: 3.5401
quadrupole: -123.5490 -116.5900 -145.9892
quadrupole: -11.6730 3.8170 -4.9385
quadrupole: 5.1603 12.1194 -17.2798 -11.6730 3.8170 -4.9385
hfenergy: -1243.5479792 hartree
pointgroup: C01 [X(C19H22N2S1)]
dipole: 0.7589153 -0.355953 1.112274 debye
polarizability: 354.4163287|-16.7986253|249.8738623|10.9999458|-14.6892418|139.4822473 unknown
InChI: InChI=1S/C19H22N2S/c1-14(20-2)10-16-12-21-19-9-8-17(11-18(16)19)22-13-15-6-4-3-5-7-15/h3-9,11-12,14,20-21H,10,13H2,1-2H3
charge 0 multiplicity 1
44 atoms
S  -1.791541 -0.794684 -1.163044
N  3.726084 -2.592502 0.442807
N  3.628761 3.439328 -0.146826
C  3.937743 1.010344 -0.607401
C  3.579187 -0.408108 -0.242286
C  3.424995 2.07996 0.409707
C  2.254839 -1.011804 -0.296279
C  2.378802 -2.380557 0.138077
C  4.442779 -1.405095 0.211388
C  4.164324 1.967912 1.756016
C  0.976525 -0.526557 -0.681047
C  1.273579 -3.259466 0.190964
C  -0.128537 -1.398746 -0.630186
C  0.018726 -2.753607 -0.200904
C  2.679376 3.859706 -1.193804
C  -2.5304 -0.379413 0.576277
C  -3.915004 0.195449 0.421333
C  -5.054845 -0.650514 0.41653
C  -4.103326 1.593367 0.260799
C  -6.352181 -0.112799 0.263754
C  -5.399089 2.134222 0.108159
C  -6.528471 1.282254 0.109913
H  5.033896 1.131521 -0.691448
H  3.517549 1.248585 -1.604107
H  2.336847 1.88075 0.589511
H  5.51772 -1.358273 0.378415
H  4.12822 -3.470227 0.763234
H  3.743732 2.667239 2.504102
H  5.235943 2.207297 1.619881
H  4.080826 0.945111 2.160719
H  0.841163 0.505216 -1.021905
H  3.705683 4.138493 0.602505
H  1.378265 -4.301355 0.513388
H  -0.861074 -3.405713 -0.195423
H  2.83907 3.278337 -2.120088
H  2.852823 4.921353 -1.444052
H  1.604727 3.740263 -0.90606
H  -1.830017 0.332441 1.041951
H  -2.529596 -1.322597 1.146107
H  -4.920409 -1.733063 0.530462
H  -3.228896 2.255397 0.253943
H  -7.222778 -0.778445 0.264853
H  -5.528884 3.215865 -0.011357
H  -7.534438 1.700814 -0.007578
