program: Gaussian 09
title: 000229505
version: EM64L-G09RevD.01
frameworkgroup: C1[X(C10H9NO5)]
method: RPBEPBE
basis: SDD
operation: Freq
keyword: #p
keyword: freq=noraman
keyword: PBEPBE/SDD
title: #p freq=noraman PBEPBE/SDD
converged: YES YES NO NO
title: Mulliken charges:
elementType: O O O O O N C C C C C C C C C C H H H H H H H H H
charge: -0.209194 -0.408430 -0.242253 -0.200742 -0.189919 0.025156 -0.514837 0.312080 0.139204 -0.491560 -0.460879 -0.341419 0.370159 -0.206181 -0.351415 0.184979 0.248415 0.273354 0.286543 0.266750 0.329262 0.261254 0.245737 0.293515 0.380423
chargesum: 0.00000
title: Mulliken charges with hydrogens summed into heavy atoms:
elementType: O O O O O N C C C C C C C C C C
charge: -0.209194 -0.028007 -0.242253 -0.200742 -0.189919 0.025156 0.006933 0.312080 0.139204 0.061733 -0.131618 -0.080165 0.370159 0.039555 -0.057900 0.184979
polarizability: 1.98100670e+02 4.27873652e+00 1.43002570e+02 -1.86391276e+00 -3.97074757e-01 6.17905676e+01
1716.lowfreq: -6.1554 -0.0010 -0.0003 0.0006 2.0740 4.4387 18.2781 26.5670 49.9178
frequency: 18.1789 26.5219 49.9158 55.8808 61.7316 109.6413 143.8057 153.9088 182.7394 216.4831 248.2427 305.2610 382.2726 411.9976 428.6249 442.7508 487.4597 505.9376 533.3245 566.9745 587.0696 636.6976 645.6065 670.0643 686.0082 701.3492 752.1199 797.4397 826.3905 833.2056 897.8503 948.7895 977.9095 988.5067 1007.2753 1009.0543 1017.6665 1059.5055 1076.0671 1090.3968 1106.8183 1150.0345 1181.3356 1200.6303 1221.9705 1247.7943 1260.8136 1283.9745 1321.5451 1376.0334 1379.7171 1394.9484 1432.3155 1438.9658 1444.0500 1475.1563 1572.7953 1603.7871 1615.4102 1660.2809 2980.7058 3012.5920 3031.2295 3077.4468 3150.7806 3168.4799 3176.1269 3187.1036 3514.5011
redmass: 8.3419 10.4671 11.0519 5.6588 5.2341 2.3704 7.8658 4.9148 3.9492 6.9551 6.9620 8.8978 8.7498 3.0886 5.3013 4.0950 3.7909 2.6727 4.2805 3.0042 3.9688 6.1309 1.4382 8.2051 2.2656 4.7980 8.1211 1.7154 1.7277 4.7725 3.6475 1.4081 1.4487 6.2169 1.5808 2.6699 2.4647 2.3096 1.7461 1.7424 2.7523 1.2190 1.1580 2.8950 3.4486 1.7201 1.2521 1.3738 1.9768 2.7827 4.6702 7.0190 2.9876 1.1173 1.1095 2.5285 6.9109 8.3026 7.2550 8.1540 1.0617 1.0648 1.0960 1.0962 1.0877 1.0940 1.0921 1.0972 1.0640
irintensity: 3.5040 1.2179 1.5340 0.9060 1.4508 0.1603 3.1579 1.6141 1.1961 3.7011 2.3414 4.2454 5.0793 0.5202 16.1637 0.1159 20.1495 45.3816 33.7477 11.9530 20.3471 2.2111 122.2337 27.4228 15.7141 33.6408 9.7922 45.6274 10.8196 5.6783 1.8481 0.4852 16.2807 1.0298 4.9876 12.7103 15.2044 250.0155 108.4527 28.0408 10.6736 1.7078 21.3123 159.8744 156.9217 42.9351 35.6150 4.1257 173.6318 92.2666 46.8044 4.6613 16.5733 1.3941 64.2553 2.3224 71.9691 62.1027 23.0613 182.1161 29.3923 17.0974 5.0615 5.2221 5.2866 4.7702 11.8984 5.1734 28.7903
temp: 298.150 k
press: 1.00000 atm
elementType: 8 8 8 8 8 7 6 6 6 6 6 6 6 6 6 6 1 1 1 1 1 1 1 1 1
symmnumber: 1
zpe: 467787.5 jmol-1
zpe.correction: 0.178171 hartree
zpe.thermalcorrener: 0.192988 hartree
zpe.thermalcorrenthalpy: 0.193932 hartree
zpe.thermalcorrgfe: 0.132836 hartree
zpe.sumelectzpe: -816.101494 hartree
zpe.sumelectthermal: -816.086677 hartree
zpe.sumelectthermalent: -816.085733 hartree
zpe.sumelectthermalfe: -816.146829 hartree
dipole: -3.7326 4.2180 1.0403
dipole: 5.7277
quadrupole: -104.6613 -96.1586 -91.5240
quadrupole: 12.5905 -1.6169 2.1840
quadrupole: -7.2133 1.2893 5.9240 12.5905 -1.6169 2.1840
hfenergy: -816.2796649 hartree
pointgroup: C01 [X(C10H9N1O5)]
dipole: -1.4787758 -1.6517491 -0.4036579 debye
dipolederiv: -0.7941687 0.0765153 -0.0055106 0.290797 -0.8015426 -0.0500178 0.019399 -0.0441422 -0.2951238 -1.1733589 0.4774783 -0.2260856 0.4272984 -0.5100843 0.0459939 -0.2170752 0.0457894 -0.4474088 -0.7748526 -0.10111 0.0553092 0.1134657 -0.8334422 0.2507181 -0.0450573 0.2359971 -0.4272311 -0.8852505 0.123348 -0.0026322 0.0242834 -0.4965303 -0.0125261 -0.0077561 -0.0117811 -0.2252326 -0.5535549 -0.1077903 -0.0097106 -0.101449 -0.7619889 -0.0274491 -0.0097497 -0.027254 -0.2158593 1.5711073 0.179899 0.0269659 0.3114025 1.1509602 0.0492485 0.0358335 0.04896 0.1910943 -0.393296 -0.1038218 -0.0234966 -0.3578017 -0.1287389 -0.0000036 0.0129807 0.018523 0.1204896 -0.6662739 0.1169764 -0.0015628 0.1068438 -0.2381575 -0.0136254 -0.0193904 -0.0129242 -0.0261158 1.6998573 -0.2113707 0.0323517 -0.3220563 0.8575811 0.069287 0.0326682 0.052988 0.1343371 -0.2587062 -0.0893513 0.0340467 -0.3108251 -0.1053764 0.0640393 0.0221583 0.0326656 0.1024511 0.1365537 0.0670113 0.0048068 0.0394338 -0.0708221 -0.0029141 0.0155539 -0.0005767 -0.0538637 0.1454381 0.0414437 0.0053977 -0.122493 0.0658127 0.007092 -0.0153777 0.01008 -0.0964963 -0.3764324 -0.1413149 -0.0129747 -0.1778564 -0.1506999 -0.0129232 -0.0148311 -0.0117373 0.053855 -0.4049528 -0.0013928 -0.0034101 -0.0504705 0.2022712 0.0158109 -0.0061278 0.0144269 -0.1350985 0.0520995 -0.0457078 0.0000352 0.2470637 0.0364132 0.009805 0.0144032 0.0053987 -0.0884919 1.6982113 -0.178548 0.0929198 -0.2250782 1.1155749 -0.4298634 0.14536 -0.4061547 0.3907417 0.0485881 0.0270652 0.0313845 0.0844115 0.0237486 -0.0846041 0.0439416 -0.090956 -0.0097289 0.1439118 0.0088592 -0.024758 0.1053011 0.0464816 0.067222 -0.0733415 0.0644532 0.0162589 0.1517309 -0.0286204 0.0046272 0.0832746 0.0669313 -0.0672841 0.022861 -0.0599947 0.0441289 0.0488617 0.0052423 -0.0177268 0.0586731 0.0859356 0.0566026 -0.0082031 0.0713119 -0.0190622 0.1938395 0.0015508 -0.0005907 -0.0160224 0.1043455 -0.0019629 -0.0045437 -0.0025874 0.1655525 -0.0062135 -0.0836116 -0.0055596 -0.1010926 0.0839952 -0.0040138 -0.0049767 -0.0041918 0.1400513 0.0715465 0.0001195 -0.0004916 0.0098766 -0.0805008 -0.0117973 -0.000307 -0.0107892 0.1552925 0.0692666 0.0560289 0.0017459 0.0245929 0.1240736 -0.0018532 -0.0006038 -0.0011108 0.1713339 0.2560484 -0.0888982 0.0449193 -0.1415728 0.2137592 0.0850186 0.0621819 0.0836062 0.3541264 unknown
polarizability: 198.068683|-4.5640652|143.0483427|1.2750291|-0.3524995|61.7767819 unknown
InChI: InChI=1S/C10H9NO5/c12-9(4-5-10(13)14)7-2-1-3-8(6-7)11(15)16/h1-3,6,13H,4-5H2
charge 0 multiplicity 1
25 atoms
O  -0.920187 1.858546 0.163049
O  -5.868732 0.73691 -0.204617
O  -4.839395 -1.145579 0.680256
O  5.181138 -0.006943 0.072881
O  3.995597 1.939921 0.151043
N  4.073313 0.655362 0.090359
C  -2.236592 -0.177626 -0.08747
C  0.371317 -0.165587 0.002016
C  -0.927765 0.601288 0.030836
C  -3.464813 0.742523 -0.142783
C  1.580339 0.572994 0.057458
C  0.42387 -1.583838 -0.069948
C  2.80163 -0.120623 0.036187
C  1.665189 -2.257955 -0.085773
C  2.871347 -1.53038 -0.034269
C  -4.743198 -0.011412 0.158073
H  -2.199572 -0.831873 -0.980201
H  -2.331638 -0.866498 0.776671
H  -3.357347 1.560604 0.595702
H  -3.560383 1.248421 -1.118788
H  1.550454 1.66499 0.116415
H  -0.500462 -2.168597 -0.108041
H  1.693258 -3.350676 -0.137712
H  3.847889 -2.021477 -0.046805
H  -6.69286 0.233204 0.038361
