program: Gaussian 09
title: 000229503
version: EM64L-G09RevD.01
frameworkgroup: C1[X(C7H14O)]
method: RPBEPBE
basis: SDD
operation: Freq
keyword: #pfreq=noraman
keyword: PBEPBE/SDD
title: #p freq=noraman PBEPBE/SDD
converged: YES YES NO NO
title: Mulliken charges:
elementType: O C C C C C C C H H H H H H H H H H H H H H
charge: -0.451767 -0.000462 -0.438468 -0.412916 -0.056922 -0.408005 -0.426479 -0.740413 0.194794 0.215677 0.203339 0.197386 0.187606 0.179307 0.200640 0.196015 0.209947 0.184550 0.211731 0.210352 0.216111 0.327974
chargesum: 0.00000
title: Mulliken charges with hydrogens summed into heavy atoms:
elementType: O C C C C C C C
charge: -0.123793 0.194332 -0.019452 -0.027923 0.122385 -0.011350 -0.031982 -0.102218
polarizability: 8.70397822e+01 1.54905698e+00 7.72784196e+01 6.02511518e-02 7.16280240e-01 6.46827349e+01
1716.lowfreq: -22.1536 -0.0009 -0.0003 0.0002 12.2754 30.0528 141.9743 150.5916 213.1127
frequency: 141.9696 150.5840 213.1003 246.3340 275.2932 304.6395 352.6566 396.8582 410.0415 439.3770 470.6565 531.2884 769.3576 831.2692 855.6112 873.0468 895.4072 930.0860 970.5222 978.2536 994.1794 1045.6365 1062.3043 1093.7827 1101.2289 1131.3998 1160.9615 1204.1545 1225.1168 1255.1401 1263.1884 1282.0201 1300.0836 1308.0036 1331.7976 1336.3752 1346.4196 1357.4087 1384.7325 1395.3952 1457.1055 1459.2303 1467.5991 1472.5349 1475.8542 1478.1931 2918.0980 2942.1005 2960.9967 2962.4216 2967.0921 2969.7634 2981.0222 3024.2862 3025.4499 3039.9151 3047.7332 3062.6396 3066.9431 3546.1744
redmass: 2.4742 2.4736 1.0489 2.6275 1.8263 1.1280 2.8779 3.5513 3.5531 1.8513 2.4450 2.2377 1.9395 2.1227 1.3902 1.7988 1.9514 2.0902 1.4748 1.6540 3.4516 1.5480 1.1951 1.6269 2.5892 1.8608 2.1873 1.4918 1.3216 1.3172 1.2539 1.2586 1.2915 1.2314 1.3882 1.4525 1.5916 1.5429 1.2201 1.6683 1.0873 1.0907 1.0870 1.0588 1.0732 1.0656 1.0834 1.0811 1.0620 1.0597 1.0369 1.0641 1.0611 1.1017 1.0960 1.1017 1.1017 1.0992 1.0993 1.0659
irintensity: 1.9239 0.6145 0.0163 7.6662 1.2824 135.7480 10.6885 2.2375 1.2675 0.5635 8.6969 2.7000 1.4070 13.9022 1.6147 6.8384 13.7629 12.2058 13.0860 1.8739 42.4625 19.2700 14.6274 4.5607 3.3041 1.5033 3.8495 12.7606 17.0947 2.0427 2.1333 15.4349 1.7520 0.0332 0.3251 8.3429 7.2876 12.9046 12.1821 4.0391 1.3453 6.4460 15.6375 3.9719 18.0772 8.5762 46.0562 18.7420 34.2551 34.4545 50.2680 47.8526 32.8873 26.5977 66.0290 42.2130 50.0223 83.3979 47.7464 2.6200
temp: 298.150 k
press: 1.00000 atm
elementType: 8 6 6 6 6 6 6 6 1 1 1 1 1 1 1 1 1 1 1 1 1 1
symmnumber: 1
zpe: 520021.7 jmol-1
zpe.correction: 0.198066 hartree
zpe.thermalcorrener: 0.206623 hartree
zpe.thermalcorrenthalpy: 0.207567 hartree
zpe.thermalcorrgfe: 0.165683 hartree
zpe.sumelectzpe: -349.698636 hartree
zpe.sumelectthermal: -349.690079 hartree
zpe.sumelectthermalent: -349.689135 hartree
zpe.sumelectthermalfe: -349.731019 hartree
dipole: -0.0939 1.8187 0.8487
dipole: 2.0092
quadrupole: -48.1055 -54.5632 -50.5773
quadrupole: 3.9571 1.8741 -1.0206
quadrupole: 2.9764 -3.4812 0.5047 3.9571 1.8741 -1.0206
hfenergy: -349.8967014 hartree
pointgroup: C01 [X(C7H14O1)]
dipole: -0.05314 -0.7138 -0.3354299 debye
dipolederiv: -0.6787078 -0.3327548 -0.1119773 -0.3727844 -0.5252596 0.1202692 -0.1397596 0.1061189 -0.4851681 0.1045049 0.0061512 0.0139078 0.0396977 0.089563 0.0006329 0.066239 -0.0119597 0.172153 -0.1385831 -0.0062002 0.0083774 0.0419719 0.0291604 -0.0329637 0.0185304 -0.0045585 0.1124772 0.0124397 0.0447545 0.0255169 0.0231 0.0126577 0.0245992 -0.0032688 -0.0054393 0.1452387 0.6273077 0.1911454 0.0706774 0.1817073 0.4298718 -0.0156333 0.0315783 -0.0412659 0.4190505 0.062832 0.0190712 0.0062179 0.0138488 0.0610953 -0.0151062 0.0098787 0.0341226 0.1636215 0.0038141 -0.0504095 -0.0460656 -0.1268926 -0.1038244 0.0402301 -0.0179567 0.0350385 0.088483 -0.0338235 0.0544834 0.0318916 0.0485619 0.0215815 -0.0146559 0.0035316 -0.0007554 0.0930635 0.0338123 -0.0018712 0.0361035 -0.0065583 0.0210957 -0.0362902 -0.0056052 -0.0174079 -0.2110208 0.0654258 0.0169657 -0.0127577 0.0119088 -0.1666423 0.0734885 0.000474 0.0921765 0.0443174 0.0520532 -0.0026212 0.0098335 0.0051134 0.0782419 0.0060774 0.000461 -0.0466912 -0.1538098 -0.1566635 -0.1261367 -0.0449109 -0.1064683 -0.0233479 -0.0190205 -0.0663186 -0.0412457 0.0573067 0.0640943 0.0218779 -0.0048287 0.0295395 0.0405084 -0.0440686 0.0397637 0.0104581 -0.186328 -0.0227511 -0.0150173 -0.0188511 -0.0184606 -0.0207384 -0.039274 -0.0216203 -0.0239606 -0.2514676 0.0217848 0.0135432 -0.0031779 0.010976 -0.2097624 0.0710807 -0.0059977 0.1078508 0.0474592 0.0163223 -0.0016591 -0.0026733 -0.0029211 0.0809806 -0.0005295 0.0021261 -0.0793541 -0.1939216 0.0731287 -0.0109089 0.0106065 -0.0214902 0.0449871 -0.0379302 -0.036103 0.0070216 -0.1604105 -0.1975233 0.1132795 0.051014 0.0955323 -0.0091394 -0.0205927 0.0889941 -0.0309641 0.0526809 -0.1455339 -0.0714357 -0.04292 -0.139301 0.022555 -0.0461789 -0.0591046 -0.0417642 0.066867 0.0708435 0.0071181 -0.0389771 0.0123706 0.0827197 0.0023652 0.0394288 -0.0399644 -0.1723618 0.0726111 0.0050853 0.0148889 0.0699994 -0.1647463 0.0829876 -0.0057896 0.098124 0.0489492 0.0926117 0.1255393 0.0481043 0.2105488 0.2084425 -0.099487 0.0605183 -0.10558 0.3028205 unknown
polarizability: 86.9789281|-1.7094243|77.3310243|-0.3013239|0.7733003|64.6909842 unknown
InChI: InChI=1S/C7H14O/c1-6-3-2-4-7(8)5-6/h6-8H,2-5H2,1H3
charge 0 multiplicity 1
22 atoms
O  2.397728 1.2098 0.132659
C  -1.282322 0.313978 -0.323556
C  -0.011485 1.103633 0.083401
C  -1.218812 -1.130627 0.238954
C  1.272589 0.380764 -0.347257
C  0.07746 -1.860062 -0.186732
C  1.330395 -1.050165 0.226906
C  -2.561374 1.047401 0.133401
H  -1.30115 0.241108 -1.43377
H  -0.024151 2.11771 -0.359138
H  0.015155 1.228995 1.185175
H  -2.106071 -1.702606 -0.097443
H  -1.267109 -1.083421 1.34763
H  1.302246 0.318485 -1.460326
H  0.117009 -2.870303 0.263546
H  0.074033 -2.001812 -1.287737
H  1.386183 -0.977433 1.33174
H  2.251531 -1.564549 -0.118043
H  -3.471501 0.50013 -0.176509
H  -2.584066 1.144324 1.236161
H  -2.614269 2.065993 -0.29433
H  3.247782 0.752159 -0.09373
