program: Gaussian 09
title: 000229501
version: EM64L-G09RevD.01
frameworkgroup: C1[X(C6H14N2O2)]
method: RPBEPBE
basis: SDD
operation: Freq
keyword: #p
keyword: freq=noraman
keyword: PBEPBE/SDD
title: #p freq=noraman PBEPBE/SDD
converged: YES YES NO NO
title: Mulliken charges:
elementType: O O N N C C C C C C H H H H H H H H H H H H H H
charge: -0.507031 -0.284373 -0.372438 -0.517326 0.291916 -0.160714 -0.731602 -0.719959 -0.750314 0.147142 0.249229 0.230551 0.201664 0.238522 0.226625 0.200680 0.253027 0.221564 0.215773 0.252626 0.345478 0.370323 0.304401 0.294235
chargesum: 0.00000
title: Mulliken charges with hydrogens summed into heavy atoms:
elementType: O O N N C C C C C C
charge: -0.161553 -0.284373 -0.002115 0.081309 0.291916 0.088516 -0.060866 -0.039626 -0.060351 0.147142
polarizability: 1.00366071e+02 -2.39731043e+00 8.85848689e+01 7.98538861e-01 2.82090517e+00 7.11090685e+01
1716.lowfreq: -18.9666 -14.1875 -0.0006 0.0004 0.0007 6.2721 46.7272 76.7044 112.3197
frequency: 46.6623 76.6821 112.3115 159.0307 167.0086 203.0781 206.7616 237.8159 262.1423 283.7477 307.7537 321.1828 338.1198 359.7593 388.2139 417.2366 481.7413 506.4759 588.4105 712.7107 747.0820 778.4547 811.4943 836.8369 902.5299 916.5494 927.2321 986.2266 1027.4621 1054.4238 1084.7892 1099.5307 1155.3427 1162.5539 1189.2557 1242.2122 1287.9868 1298.2413 1305.3950 1318.9599 1379.9207 1392.4210 1402.5637 1456.1744 1457.4822 1469.0633 1474.3944 1481.0916 1482.5218 1487.0332 1598.9451 1679.4076 2977.7334 2980.8541 2983.4216 3002.3932 3066.9107 3074.1266 3094.6772 3097.1807 3099.2560 3108.8301 3366.1440 3409.1686 3481.4501 3565.7154
redmass: 6.2269 3.4362 1.6510 1.7852 1.1475 1.1168 2.3298 2.3628 1.3233 2.4626 3.1159 1.2135 3.0552 2.7216 3.1648 3.3057 3.0562 3.6398 3.9004 3.2834 3.7279 1.2305 1.7557 2.7101 2.5201 1.5039 2.1196 1.2848 1.5901 1.8644 1.5114 2.0046 2.5066 2.1441 2.7244 2.0957 1.2433 1.5385 1.7162 2.0413 1.2245 1.2239 1.1962 1.0550 1.0503 1.0500 1.0853 1.2782 1.0660 1.2479 6.1313 1.0714 1.0381 1.0648 1.0536 1.0367 1.0974 1.0970 1.1001 1.0996 1.0997 1.0986 1.0443 1.0809 1.0973 1.0660
irintensity: 4.3281 2.0005 23.4215 22.3718 0.1672 0.1170 12.7715 8.1259 0.3028 25.7298 7.2999 98.9574 15.3446 3.3990 16.8424 14.3909 6.7873 10.8289 6.1375 28.5516 24.4030 145.9070 95.9237 75.7014 20.7364 2.7008 25.6035 0.7582 7.1271 31.0904 21.7471 57.3528 3.1067 1.4104 19.4719 30.7145 2.1713 9.1895 17.7003 22.2360 28.0885 23.6840 25.0361 13.1105 3.5064 9.0668 13.7209 94.4603 12.2812 67.1358 202.0178 15.6378 17.9314 26.0435 11.3396 23.2186 3.4795 52.9878 35.2286 14.3439 23.7235 20.5286 8.7733 162.6170 3.1034 3.7826
temp: 298.150 k
press: 1.00000 atm
elementType: 8 8 7 7 6 6 6 6 6 6 1 1 1 1 1 1 1 1 1 1 1 1 1 1
symmnumber: 1
zpe: 534600.9 jmol-1
zpe.correction: 0.203619 hartree
zpe.thermalcorrener: 0.216235 hartree
zpe.thermalcorrenthalpy: 0.217179 hartree
zpe.thermalcorrgfe: 0.165808 hartree
zpe.sumelectzpe: -496.143959 hartree
zpe.sumelectthermal: -496.131343 hartree
zpe.sumelectthermalent: -496.130398 hartree
zpe.sumelectthermalfe: -496.181770 hartree
dipole: -3.2247 -1.8919 -0.1807
dipole: 3.7431
quadrupole: -57.5973 -65.1994 -61.3306
quadrupole: 0.3686 -3.6461 -2.7462
quadrupole: 3.7785 -3.8236 0.0452 0.3686 -3.6461 -2.7462
hfenergy: -496.3475777 hartree
pointgroup: C01 [X(C6H14N2O2)]
dipole: -1.3130122 0.6668566 -0.0006967 debye
dipolederiv: -0.5820483 -0.0804602 0.1451809 -0.1847618 -0.758696 -0.1609045 0.1450199 -0.1722718 -0.5004828 -0.6675577 0.3335862 0.1027383 -0.0189616 -0.902793 -0.0745933 0.129819 -0.2089334 -0.394157 -0.2628192 -0.1139825 -0.1132982 -0.1923581 -0.7386181 -0.1049568 -0.1330469 -0.1841386 -0.4176296 -0.1923043 -0.0675585 0.0447204 -0.1446711 -0.5081665 0.1105022 0.0948574 0.0906674 -0.1029451 0.4443136 0.0116847 -0.0319625 0.0233106 0.5940761 0.0853931 0.0165575 0.0609665 0.4326144 -0.2308768 0.0333924 0.0633661 0.0200777 0.0092561 -0.0284098 0.0801788 -0.0091001 0.0796791 -0.1731998 -0.0720461 0.0556485 0.0360623 0.0190697 -0.0193672 0.0323466 0.0046179 -0.0017486 -0.0155993 -0.0162711 0.0395799 -0.0180385 -0.0139904 0.0164978 0.020163 -0.0479756 -0.2042891 0.007097 0.0146702 -0.0345274 0.0133319 -0.05481 0.0058544 -0.0305164 0.0370721 0.0735653 0.7764317 -0.0714065 -0.1204355 0.1970919 1.2964274 0.2193692 -0.2205459 0.2967777 0.1992411 0.0229109 -0.0200831 0.0020442 -0.0147239 0.0292806 -0.0655967 0.0061061 -0.0370204 -0.1026215 0.0688286 -0.0600411 -0.0062958 -0.1012792 -0.0826397 -0.0640143 -0.0131146 -0.0751174 0.0644462 -0.0444157 0.0765661 -0.0305482 0.1449394 -0.065409 0.0755538 -0.0676201 0.0937635 0.0497195 0.0793502 -0.0099939 -0.0023268 -0.010479 0.0972587 0.0043699 0.0504998 0.0060801 -0.1428946 0.0900468 -0.0391401 -0.0079804 -0.0565779 -0.0895147 -0.09199 -0.0034725 -0.0571307 0.077404 -0.0359154 0.1179538 -0.092355 0.1233501 -0.0225216 0.0895488 -0.0550095 0.042381 0.0250817 -0.0811602 -0.0555697 0.0902332 -0.0517448 0.0748498 0.0185798 0.0720148 -0.0007507 0.0607785 0.0918032 -0.0246265 -0.0157289 -0.0264945 0.067707 -0.0284753 -0.0378484 -0.0773323 -0.1202384 -0.1234536 -0.0893527 0.1088629 -0.0467516 0.076002 -0.0059466 0.1020956 0.0098214 0.035078 0.0285359 0.1197417 -0.0833524 0.0737207 0.01837 0.0539609 -0.0712037 0.0452084 0.0559231 0.1540936 0.126963 -0.1413562 0.0702646 0.220748 0.0695116 -0.1633394 0.1144832 0.2517499 0.4478386 -0.0705044 0.0747013 -0.0959902 0.2378631 0.0129413 0.1200561 0.1088524 0.3064634 0.1473858 -0.0295168 -0.0000426 0.0893466 0.1541933 -0.1815814 -0.0013996 -0.0764104 0.2078906 0.0507145 -0.0140049 -0.0468657 0.1713367 0.3420571 0.0637534 -0.0725972 0.0354898 0.0673717 unknown
polarizability: 99.973716|2.95795|89.3465067|-1.8101201|0.2235015|70.7397853 unknown
InChI: InChI=1S/C6H14N2O2/c1-4(5(9)8-7)6(2,3)10/h4,8,10H,7H2,1-3H3
charge 0 multiplicity 1
24 atoms
O  -0.947514 1.766265 0.51182
O  1.831944 -1.36248 -0.142684
N  1.623292 0.889557 0.379701
N  2.922631 1.218837 -0.117794
C  -1.34364 0.396648 0.027978
C  -0.346733 -0.561837 0.765202
C  -2.800738 0.155152 0.474776
C  -1.213097 0.341304 -1.50857
C  -0.748801 -2.048065 0.67132
C  1.123234 -0.396694 0.290216
H  -0.379738 -0.248173 1.829507
H  -3.182485 -0.81489 0.113349
H  -3.460608 0.944324 0.06479
H  -2.878924 0.179376 1.57593
H  -1.420934 -0.675807 -1.885175
H  -1.9374 1.028679 -1.986548
H  -0.196889 0.626683 -1.829728
H  -0.827697 -2.382964 -0.377701
H  -1.707308 -2.237324 1.183792
H  0.029665 -2.670965 1.140554
H  -1.509669 2.441771 0.055267
H  0.956366 1.662504 0.520376
H  3.161725 0.553845 -0.871224
H  3.617614 1.140657 0.640446
