program: Gaussian 09
title: 000229499
version: EM64L-G09RevD.01
frameworkgroup: C1[X(C8H16N2O)]
method: RPBEPBE
basis: SDD
operation: Freq
keyword: #p
keyword: freq=noraman
keyword: PBEPBE/SDD
title: #p freq=noraman PBEPBE/SDD
converged: YES YES NO NO
title: Mulliken charges:
elementType: O N N C C C C C C C C H H H H H H H H H H H H H H H H
charge: -0.299859 -0.085580 0.052853 -0.002649 -0.463437 -0.003169 -0.410662 -0.495123 -0.376550 -0.710814 -0.711018 0.201199 0.228299 0.198074 0.215296 0.204632 0.217598 0.262953 0.234197 0.214441 0.209771 0.230322 0.239812 0.200887 0.215075 0.210545 0.222905
chargesum: 0.00000
title: Mulliken charges with hydrogens summed into heavy atoms:
elementType: O N N C C C C C C C C
charge: -0.299859 -0.085580 0.052853 0.198549 -0.037063 0.212127 0.011568 0.002027 0.047662 -0.039792 -0.062492
polarizability: 1.07910106e+02 2.91402502e+00 1.12502202e+02 -5.33398275e+00 -3.68297833e+00 8.68464208e+01
1716.lowfreq: -16.3565 0.0006 0.0008 0.0009 13.0159 20.0867 50.2531 61.0305 93.3040
frequency: 49.9040 60.6429 93.1984 197.0470 200.5466 228.4689 254.1109 258.0425 287.3497 309.1678 345.9900 367.1411 411.0589 444.4258 473.4542 497.5345 618.0368 659.0985 731.9080 772.1579 816.4294 823.7262 869.7389 915.8863 923.3838 959.7076 995.2282 1015.9193 1034.4238 1049.5738 1063.3231 1086.2575 1113.2099 1128.6386 1156.1302 1172.1899 1197.9440 1242.4057 1253.9588 1271.6402 1281.8544 1299.9330 1316.0833 1322.6997 1339.6527 1343.4024 1350.4440 1358.7247 1363.6972 1392.0756 1399.8154 1456.9379 1459.2429 1465.7269 1471.4309 1474.8318 1477.8080 1482.0527 1491.0888 2931.4454 2962.9690 2972.1289 2975.8324 2981.4616 2985.6296 2989.7305 2999.5970 3029.1032 3041.9496 3051.5321 3061.5391 3071.0299 3075.3517 3094.5026 3109.6866
redmass: 4.3307 2.9656 2.1175 1.8656 2.5188 2.2530 1.7486 1.3452 2.7620 2.5394 5.3780 2.2017 2.2139 3.5667 2.7797 3.0067 3.3341 2.3341 2.3629 2.3925 1.8885 1.9140 1.9826 1.5482 2.0915 1.4973 1.8664 1.4377 2.6912 1.8735 2.6067 2.1957 1.3257 1.7468 2.5618 2.5845 1.4287 1.3545 1.5384 1.3975 1.6054 1.3364 2.1111 1.5186 1.6283 1.6198 1.5709 1.6556 1.4185 1.2117 1.2158 1.0793 1.0811 1.0501 1.0724 1.0650 1.0573 1.0617 1.0616 1.0829 1.0722 1.0659 1.0367 1.0605 1.0747 1.0612 1.0370 1.1004 1.0941 1.1031 1.0973 1.0998 1.0991 1.0993 1.0998
irintensity: 2.0177 0.9361 0.6455 0.5268 0.6590 2.3645 1.7024 1.4494 0.4234 1.4585 0.5316 0.3748 1.6425 1.9372 1.6435 0.4594 1.8972 1.9537 3.5885 9.7933 1.6673 2.0645 1.3034 33.6199 25.2900 18.4963 5.3768 9.8849 46.7209 22.5385 19.5590 13.4727 1.4071 8.8756 12.8895 41.9192 7.2662 9.5142 1.5865 8.2341 6.4741 11.8825 50.6633 30.2765 14.7612 17.3937 10.6745 5.4964 4.9207 14.3405 19.7133 3.6306 16.5406 10.5628 17.2826 9.3727 9.8305 15.9055 5.7619 26.3007 22.5201 7.2715 37.5342 11.0830 98.4439 11.1014 25.1425 20.9022 39.7294 48.7266 7.8191 59.9383 46.2359 31.4196 23.7153
temp: 298.150 k
press: 1.00000 atm
elementType: 8 7 7 6 6 6 6 6 6 6 6 1 1 1 1 1 1 1 1 1 1 1 1 1 1 1 1
symmnumber: 1
zpe: 617452.5 jmol-1
zpe.correction: 0.235175 hartree
zpe.thermalcorrener: 0.246891 hartree
zpe.thermalcorrenthalpy: 0.247835 hartree
zpe.thermalcorrgfe: 0.197732 hartree
zpe.sumelectzpe: -498.224001 hartree
zpe.sumelectthermal: -498.212285 hartree
zpe.sumelectthermalent: -498.211341 hartree
zpe.sumelectthermalfe: -498.261444 hartree
dipole: -2.2791 -4.1093 1.5754
dipole: 4.9561
quadrupole: -70.6643 -75.3236 -66.0836
quadrupole: -8.3687 1.7790 2.0690
quadrupole: 0.0262 -4.6331 4.6069 -8.3687 1.7790 2.0690
hfenergy: -498.4591761 hartree
pointgroup: C01 [X(C8H16N2O1)]
dipole: -1.0943806 1.4001869 -0.8023864 debye
polarizability: 108.2957729|-2.679429|110.7957329|7.0354783|-5.2042808|88.1672232 unknown
InChI: InChI=1S/C8H16N2O/c1-3-8-5-4-7(2)10(6-8)9-11/h7-8H,3-6H2,1-2H3
charge 0 multiplicity 1
27 atoms
O  1.735203 -2.196976 0.584729
N  1.0093 -0.217531 -0.216948
N  1.855318 -0.911762 0.62805
C  -1.41921 -0.373466 -0.769655
C  -1.432438 1.179885 -0.825749
C  1.059444 1.269318 -0.203359
C  -0.365554 1.809422 0.101723
C  0.016206 -0.86807 -1.100873
C  -1.913028 -0.966885 0.577667
C  2.11615 1.819227 0.767674
C  -3.367817 -0.595578 0.93659
H  -2.086972 -0.75447 -1.570735
H  -2.434841 1.56844 -0.568619
H  -1.233667 1.499004 -1.870461
H  1.324515 1.581684 -1.238479
H  -0.354854 2.909177 -0.020651
H  -0.601679 1.603493 1.163704
H  0.124502 -1.957347 -0.953418
H  0.270509 -0.624242 -2.152272
H  -1.235475 -0.656945 1.39719
H  -1.826065 -2.069723 0.517287
H  1.899321 1.52186 1.80735
H  3.127097 1.455987 0.521531
H  2.109462 2.922641 0.706576
H  -3.485491 0.487159 1.125372
H  -4.063351 -0.873018 0.12162
H  -3.692381 -1.126584 1.849856
