program: Gaussian 09
title: 000229470
version: EM64L-G09RevD.01
frameworkgroup: C1[X(C4H2Cl6O2)]
method: RPBEPBE
basis: SDD
operation: Freq
keyword: #p
keyword: freq=noraman
keyword: PBEPBE/SDD
title: #p freq=noraman PBEPBE/SDD
converged: NO NO NO NO
title: Mulliken charges:
elementType: Cl Cl Cl Cl Cl Cl O O C C C C H H
charge: 0.110701 0.129360 0.129378 0.152476 0.132897 0.132873 -0.204724 -0.174717 -0.108568 -0.630249 0.510777 -0.749741 0.284767 0.284772
chargesum: 0.00000
title: Mulliken charges with hydrogens summed into heavy atoms:
elementType: Cl Cl Cl Cl Cl Cl O O C C C C
charge: 0.110701 0.129360 0.129378 0.152476 0.132897 0.132873 -0.204724 -0.174717 0.460971 -0.630249 0.510777 -0.749741
polarizability: 1.16312144e+02 -5.69964803e-01 1.00718461e+02 6.02442243e-03 1.50763231e-03 1.00678826e+02
1716.lowfreq: -11.8573 -4.6480 0.0019 0.0029 0.0036 1.7933 7.9972 28.3345 41.7416
frequency: -5.2104 28.1483 41.6902 56.5517 120.3149 133.0367 159.3387 206.0488 212.8354 237.1874 245.9290 273.2712 274.2684 307.0787 333.9446 347.6740 394.7172 428.8794 523.9696 614.5364 648.4150 689.4741 743.8641 760.3570 762.1682 891.4608 970.6035 1023.3820 1107.7780 1151.3520 1228.5185 1360.7851 1438.8637 1655.4783 3029.1050 3102.7684
redmass: 24.4770 17.8639 19.0993 25.4380 13.1628 27.8422 28.3552 19.6848 20.3617 9.3198 24.1180 22.0239 21.1575 17.5944 2.7747 20.8515 24.3677 11.9881 7.5022 11.7670 5.2877 10.0583 11.7785 12.1477 12.3694 11.9261 11.4096 1.8028 5.2092 9.1619 1.0716 1.3645 1.0684 12.3007 1.0566 1.1086
irintensity: 0.2045 0.9119 1.3126 0.4251 0.0019 0.4265 0.3748 0.1837 2.0791 1.0188 0.3198 0.6186 0.9318 5.7351 2.6412 3.6053 1.3151 13.6627 35.7634 67.9201 164.1108 159.6744 53.0934 59.9106 98.8383 15.8622 144.1921 37.0002 25.1987 364.3047 19.1207 6.1811 12.9474 166.7163 6.2383 0.8693
temp: 298.150 k
press: 1.00000 atm
elementType: 17 17 17 17 17 17 8 8 6 6 6 6 1 1
symmnumber: 1
zpe: 152546.6 jmol-1
zpe.correction: 0.058102 hartree
zpe.thermalcorrener: 0.071331 hartree
zpe.thermalcorrenthalpy: 0.072275 hartree
zpe.thermalcorrgfe: 0.015192 hartree
zpe.sumelectzpe: -3063.466614 hartree
zpe.sumelectthermal: -3063.453384 hartree
zpe.sumelectthermalent: -3063.452440 hartree
zpe.sumelectthermalfe: -3063.509523 hartree
dipole: 0.9490 0.6509 0.0001
dipole: 1.1508
quadrupole: -114.2142 -113.0476 -107.2985
quadrupole: 4.5111 0.0014 0.0015
quadrupole: -2.6941 -1.5275 4.2216 4.5111 0.0014 0.0015
hfenergy: -3063.5247156 hartree
pointgroup: C01 [X(C4H2Cl6O2)]
dipole: -0.3659856 0.2665336 -0.0000251 debye
dipolederiv: -0.5890914 0.3305083 0.0000102 0.2746966 -0.4087122 0.000004 0.0000096 -0.0000037 -0.1429187 -0.1435209 0.0003795 -0.0039146 0.0037126 -0.3033613 0.2727173 -0.0478879 0.2621126 -0.5569558 -0.1435069 0.0003178 0.003816 0.0036788 -0.3034907 -0.2727764 0.0478159 -0.2621791 -0.5568191 -0.5545447 -0.3084853 -0.0001512 -0.26553 -0.2610454 -0.0000595 -0.000099 -0.0000484 -0.1111553 -0.1603787 -0.0145752 0.0392587 -0.0110935 -0.2944701 0.2980477 0.0746501 0.2537975 -0.5530147 -0.1604493 -0.0146137 -0.0394413 -0.011082 -0.2937504 -0.2976553 -0.0747954 -0.2534362 -0.5536761 -1.8512258 -0.1128235 0.0001469 -0.1733164 -0.4150071 -0.0000404 -0.0001071 -0.0001223 -0.1753655 -0.6517044 0.1137402 0.0000751 -0.3190171 -0.8220902 -0.0002966 0.0000354 -0.0001118 -0.2239734 0.8372312 -0.014449 -0.0000336 -0.2628165 -0.0005293 -0.0000061 -0.0001376 -0.0000581 0.0709952 0.917481 -0.3245356 0.0000931 -0.2900259 1.1119951 0.0000578 0.0000702 0.0000832 1.3659995 1.7441549 -0.0472133 -0.0002405 0.4220371 1.0709554 0.0004485 -0.0000699 0.0004096 0.0620428 0.8141619 0.449865 0.0003797 0.4982302 0.7953123 -0.000427 0.0004892 -0.0004747 1.3353289 -0.0293366 -0.0290473 0.0408318 0.0652568 0.0620977 0.0524537 -0.0143667 0.044679 0.0197326 -0.0292704 -0.0290681 -0.0408305 0.0652692 0.0620962 -0.0524676 0.0143933 -0.0446478 0.0197796 unknown
polarizability: 116.331883|0.1291279|100.6987223|0.0059795|-0.0016771|100.6788255 unknown
InChI: InChI=1S/C4H2Cl6O2/c5-3(6,7)1-12-2(11)4(8,9)10/h1H2
charge 0 multiplicity 1
14 atoms
Cl -3.997326 1.042221 0.000269
Cl -2.515394 -1.129812 1.516134
Cl -2.515714 -1.130187 -1.515357
Cl 3.906504 0.638462 -0.000127
Cl 2.208405 -1.348894 1.521581
Cl 2.20793 -1.346947 -1.523858
O  -0.068907 0.016204 -0.000069
O  1.22936 1.953361 0.000412
C  -1.279464 0.863056 0.000024
C  -2.493595 -0.066432 0.000253
C  1.126235 0.716747 0.00027
C  2.311716 -0.287281 -0.000465
H  -1.289336 1.500567 -0.901585
H  -1.289116 1.500733 0.901518
