program: Gaussian 09
title: 000229465
version: EM64L-G09RevD.01
frameworkgroup: C1[X(C4H3Cl6NO2)]
method: RPBEPBE
basis: SDD
operation: Freq
keyword: #p
keyword: freq=noraman
keyword: PBEPBE/SDD
title: #p freq=noraman PBEPBE/SDD
converged: YES YES NO NO
title: Mulliken charges:
elementType: Cl Cl Cl Cl Cl Cl O O N C C C C H H H
charge: 0.074294 0.147393 0.165088 0.103779 0.174656 0.092788 -0.351642 -0.187912 -0.302760 -0.015580 -0.641717 0.492462 -0.764289 0.323608 0.338058 0.351774
chargesum: 0.00000
title: Mulliken charges with hydrogens summed into heavy atoms:
elementType: Cl Cl Cl Cl Cl Cl O O N C C C C
charge: 0.074294 0.147393 0.165088 0.103779 0.174656 0.092788 0.000132 -0.187912 0.035298 0.308028 -0.641717 0.492462 -0.764289
polarizability: 1.28822759e+02 -7.16516322e+00 1.05751780e+02 5.52602250e+00 -4.21333984e+00 1.12131971e+02
1716.lowfreq: -14.3299 -3.8284 -0.0023 -0.0020 -0.0003 7.8838 11.4668 36.1677 43.7887
frequency: -12.5250 36.1542 43.7566 48.3307 110.5552 145.0450 161.6317 171.4118 193.8288 215.1300 247.1095 250.4343 262.0168 278.1942 293.1696 322.4822 354.7714 377.5690 384.7005 421.2378 519.0809 525.5034 577.2201 655.6221 691.3699 758.9097 763.9725 770.9209 775.2065 938.5994 973.0559 1017.9980 1090.7939 1191.0843 1245.8629 1307.6620 1392.8715 1479.2378 1650.0967 3094.4361 3509.1897 3512.3074
redmass: 21.2861 14.4053 14.3991 21.2012 11.7266 20.2029 21.4566 13.7528 10.5196 17.4772 13.9432 12.7740 25.6637 17.7746 12.8006 7.5272 1.4206 12.3475 17.2605 5.1076 3.2689 5.5894 3.9711 2.3435 7.5012 9.8429 9.6608 10.4012 10.7996 9.9591 4.3122 7.7903 5.9663 2.1767 1.4542 1.3438 1.1118 1.6200 9.8532 1.0856 1.0768 1.0666
irintensity: 0.9581 0.7707 2.8039 0.2948 1.9473 2.7299 1.0825 3.5103 0.3252 0.8743 1.1111 5.3792 1.3061 0.3814 2.2814 5.8205 106.0500 4.9901 8.0504 41.6807 60.9252 58.6241 38.9692 256.9288 89.6290 51.4618 126.2653 92.9672 87.8496 43.7523 78.2084 102.8129 60.5603 42.1259 92.6560 97.8741 7.7178 326.2725 152.7103 20.1066 27.0204 31.7309
temp: 298.150 k
press: 1.00000 atm
elementType: 17 17 17 17 17 17 8 8 7 6 6 6 6 1 1 1
symmnumber: 1
zpe: 195939.5 jmol-1
zpe.correction: 0.074629 hartree
zpe.thermalcorrener: 0.089131 hartree
zpe.thermalcorrenthalpy: 0.090075 hartree
zpe.thermalcorrgfe: 0.030825 hartree
zpe.sumelectzpe: -3118.750497 hartree
zpe.sumelectthermal: -3118.735995 hartree
zpe.sumelectthermalent: -3118.735051 hartree
zpe.sumelectthermalfe: -3118.794302 hartree
dipole: 1.1891 -0.0618 2.7478
dipole: 2.9947
quadrupole: -120.1409 -117.4884 -119.6857
quadrupole: -1.2809 -0.7596 -5.5171
quadrupole: -1.0359 1.6166 -0.5807 -1.2809 -0.7596 -5.5171
hfenergy: -3118.8251266 hartree
pointgroup: C01 [X(C4H3Cl6N1O2)]
dipole: -0.5009998 -0.6752558 0.8253312 debye
dipolederiv: -0.2450545 -0.0312602 0.0043525 -0.0588091 -0.3239937 0.2475872 0.0151775 0.2509641 -0.649659 -0.2037295 0.0863063 0.1184949 0.0895377 -0.3564118 -0.3106203 0.1116068 -0.281738 -0.4692215 -0.6709938 0.2715845 -0.1023495 0.2490883 -0.242076 0.0660821 -0.1190664 0.0707886 -0.1270371 -0.2383851 -0.1047046 -0.023019 -0.0619251 -0.7266576 -0.1612162 -0.0276884 -0.1253522 -0.1671348 -0.52712 -0.1890728 0.2430055 -0.1694718 -0.1485524 0.0848226 0.2388607 0.0885117 -0.2158976 -0.2327772 0.0000034 -0.042086 0.0150756 -0.1450208 -0.045957 -0.1184029 -0.0761368 -0.7859008 -0.7840443 -0.0419026 -0.0227238 0.1728962 -0.4563063 -0.3558301 0.1034121 -0.3968807 -0.4846448 -0.6306341 0.1024895 -0.0358043 -0.1916111 -0.555627 0.3164151 0.2731501 0.2697983 -0.5322288 -1.7430705 -0.013889 0.2817716 -0.0423612 -0.4690699 -0.0777785 0.158441 -0.0150975 -0.4241742 1.1194238 0.0010382 -0.0672338 -0.3704171 0.4456106 0.4050579 0.158269 0.407543 0.2853129 1.0211422 -0.3810956 -0.0726186 -0.338653 0.8950523 -0.12794 -0.0104867 -0.090645 1.317404 1.5113562 -0.1269117 -0.1892801 0.1403302 0.5425194 -0.481546 -0.533911 -0.442633 0.5194304 0.798819 0.4105279 -0.2180479 0.4333865 1.0121254 0.1867868 -0.1969373 0.1967975 1.2337329 0.1233764 -0.0390208 0.0524044 0.0413793 0.0856646 0.0141753 -0.0758652 -0.0573917 0.0559457 0.2930562 0.0214664 0.0428078 0.0772239 0.2242755 0.0496732 0.0048503 0.0614039 0.21694 0.4086352 0.034441 0.0303262 0.0143308 0.2184678 0.1902879 0.0185904 0.1400678 0.2271326 unknown
polarizability: 129.0762056|-2.3661138|104.4016051|-8.6062296|-2.360812|113.2286999 unknown
InChI: InChI=1S/C4H3Cl6NO2/c5-3(6,7)1(12)11-2(13)4(8,9)10/h1,11-12H
charge 0 multiplicity 1
16 atoms
Cl -2.562352 -1.260533 1.40302
Cl -1.930701 -1.427372 -1.575299
Cl -3.945604 0.583952 -0.573245
Cl 2.20503 -2.137631 -0.393965
Cl 3.964778 0.286829 -0.829952
Cl 2.709388 -0.183856 1.884547
O  -1.564786 1.730729 1.040764
O  1.25237 1.386793 -1.268124
N  0.050279 0.090695 0.256942
C  -1.214736 0.774361 0.015672
C  -2.356494 -0.266086 -0.200942
C  1.202064 0.484991 -0.400798
C  2.472522 -0.325307 0.023153
H  -1.103608 1.37775 -0.900359
H  0.083993 -0.659895 0.953918
H  -1.752946 1.263178 1.898366
