program: Gaussian 09
title: 000229457
version: EM64L-G09RevD.01
frameworkgroup: C1[X(C20H12ClNO2)]
method: RPBEPBE
basis: SDD
operation: Freq
keyword: #p
keyword: freq=noraman
keyword: PBEPBE/SDD
title: #p freq=noraman PBEPBE/SDD
converged: YES YES NO NO
title: Mulliken charges:
elementType: Cl O O N C C C C C C C C C C C C C C C C C C C C H H H H H H H H H H H H
charge: -0.049482 -0.212074 -0.214198 0.016898 0.091685 0.175222 0.434663 0.152344 0.048403 -0.553422 -0.368538 -0.471707 -0.412665 -0.340662 0.402999 -0.401015 -0.231874 -0.261536 0.319070 -0.361065 -0.360866 -0.203823 -0.203802 -0.117726 0.297217 0.258646 0.257870 0.252837 0.269478 0.288928 0.234320 0.235310 0.254630 0.254549 0.259702 0.259684
chargesum: 0.00000
title: Mulliken charges with hydrogens summed into heavy atoms:
elementType: Cl O O N C C C C C C C C C C C C C C C C C C C C
charge: -0.049482 -0.212074 -0.214198 0.016898 0.091685 0.175222 0.434663 0.152344 0.048403 -0.256204 -0.109892 -0.213837 -0.159828 -0.071183 0.402999 -0.112087 0.002446 -0.026226 0.319070 -0.106435 -0.106317 0.055879 0.055882 -0.117726
polarizability: 4.10510139e+02 -2.89224335e+01 2.79525146e+02 -2.13945411e-02 2.45252108e-02 1.27491590e+02
1716.lowfreq: -49.0432 -7.0807 -5.5412 -0.0017 -0.0017 0.0007 0.3531 29.8094 32.1896
frequency: -49.0383 29.7935 32.1822 50.8737 61.8434 96.2627 105.0838 125.5329 143.3430 176.5416 192.1274 236.4926 255.8349 292.0693 314.7835 318.7096 383.2516 390.4025 399.5771 408.0008 432.6622 475.2658 480.5617 490.4879 499.0320 536.1986 557.8383 563.8942 620.6281 623.2191 625.5318 642.6322 669.9777 701.3707 711.5519 725.0404 741.9406 753.0964 776.2270 784.6696 788.9041 820.3155 831.8304 850.1942 858.2532 859.0464 889.0180 941.6551 946.2432 960.1092 967.1700 969.8246 989.3105 995.0912 995.1416 999.8113 1030.4026 1064.3301 1072.4948 1088.7259 1103.8533 1125.9897 1143.8604 1174.5133 1184.4574 1201.9058 1208.5137 1231.0540 1242.2991 1269.4143 1290.7435 1305.2918 1333.0333 1344.8112 1359.7595 1384.8954 1387.9490 1405.0630 1434.1651 1445.2033 1465.3045 1471.5720 1483.6998 1572.2378 1583.1158 1587.6636 1593.5841 1614.3651 1616.2482 1664.1922 3075.6761 3130.8296 3142.8687 3144.8823 3145.8907 3149.6309 3160.8572 3167.4390 3171.9924 3175.2303 3178.0302 3186.2193
redmass: 3.8516 11.1053 6.9173 7.9666 8.5217 10.0768 4.6716 7.4972 4.3598 5.5553 7.7672 7.5552 5.7406 7.3293 4.9950 8.0281 3.7816 2.8625 8.4014 2.7595 3.5617 4.5796 8.9027 3.3844 5.2308 5.5594 3.7770 4.9971 4.0647 6.4235 6.9241 7.2776 5.3526 5.6138 5.4291 5.1770 2.1744 4.7251 2.7633 7.4973 2.0148 1.8485 1.2828 1.5047 3.7496 1.5944 1.5530 1.4988 1.7836 1.4229 2.5233 1.3672 1.3667 1.3470 6.7332 4.2128 2.0842 2.3292 2.7292 2.5264 1.3793 1.5343 1.8401 1.1731 1.1303 2.0677 6.9179 2.5931 2.2633 1.4351 1.2549 1.9680 1.7583 5.3531 9.6075 3.5359 4.7087 4.1861 2.7369 3.5425 3.2128 2.5759 4.4542 7.6374 6.6000 7.7923 6.2886 7.0354 7.7366 9.8280 1.0877 1.0862 1.0911 1.0896 1.0895 1.0907 1.0965 1.0926 1.0957 1.0970 1.0968 1.0949
irintensity: 0.1719 0.6955 0.0658 0.8630 0.2503 0.7054 0.4997 0.1065 2.0873 4.6387 0.8829 1.2302 0.2943 0.8329 0.0320 0.3202 0.0021 1.6513 13.5649 1.3368 3.6177 8.7120 2.1664 0.0046 14.0849 4.1512 0.0859 5.7356 3.1738 0.0002 0.5662 1.3090 8.8457 14.2101 11.5089 6.6438 32.1106 23.3680 13.7143 5.4794 50.9216 41.9680 0.5803 0.0374 18.9247 41.0995 0.9058 20.7113 3.5847 1.0702 8.1747 0.0918 0.8214 0.0305 3.5865 66.0545 1.9066 20.0446 58.5110 9.7854 10.3032 15.4553 33.9435 0.2857 2.9753 12.9110 557.3616 10.3906 71.9490 0.3299 0.1016 10.3079 7.7825 0.2588 90.9161 4.6181 7.7083 29.0395 18.4803 42.4843 5.0584 48.9028 83.8015 0.7398 1.0962 13.8121 6.6128 14.9612 69.8214 20.6767 12.1150 1.1993 5.3670 3.8706 4.7136 8.5018 28.0153 1.3692 4.9140 0.7087 16.5148 2.2176
temp: 298.150 k
press: 1.00000 atm
elementType: 17 8 8 7 6 6 6 6 6 6 6 6 6 6 6 6 6 6 6 6 6 6 6 6 1 1 1 1 1 1 1 1 1 1 1 1
symmnumber: 1
zpe: 684268.2 jmol-1
zpe.correction: 0.260624 hartree
zpe.thermalcorrener: 0.278728 hartree
zpe.thermalcorrenthalpy: 0.279673 hartree
zpe.thermalcorrgfe: 0.212732 hartree
zpe.sumelectzpe: -1432.901721 hartree
zpe.sumelectthermal: -1432.883617 hartree
zpe.sumelectthermalent: -1432.882673 hartree
zpe.sumelectthermalfe: -1432.949614 hartree
dipole: -3.1391 4.8019 -0.0018
dipole: 5.7369
quadrupole: -178.3865 -143.2690 -140.4414
quadrupole: 21.4726 -0.0148 0.0192
quadrupole: -24.3542 10.7633 13.5909 21.4726 -0.0148 0.0192
hfenergy: -1433.1623453 hartree
pointgroup: C01 [X(C20H12Cl1N1O2)]
dipole: 1.355998 1.8042613 -0.0181508 debye
polarizability: 413.7263465|20.1179847|276.2934031|-0.4251939|-1.5122387|127.5071254 unknown
InChI: InChI=1S/C20H12ClNO2/c21-14-7-5-13(6-8-14)11-19-17-4-2-1-3-16(17)18-10-9-15(22(23)24)12-20(18)19/h1-12H
charge 0 multiplicity 1
36 atoms
Cl 6.887955 -1.597713 0.0133
O  -6.037907 -1.617599 0.022284
O  -4.335991 -3.13685 0.03457
N  -4.781459 -1.922262 0.024021
C  -1.500706 -0.083986 0.00347
C  -1.957087 1.276118 -0.008945
C  -0.008752 -0.0956 0.00228
C  -0.777107 2.155444 -0.018544
C  0.403088 1.336368 -0.011834
C  -2.417629 -1.1451 0.014327
C  -3.337052 1.573886 -0.010246
C  0.759786 -1.228182 0.01278
C  -0.687374 3.562107 -0.03228
C  1.677495 1.942769 -0.018923
C  -3.795161 -0.819554 0.012679
C  -4.267825 0.516045 0.000685
C  0.594441 4.159402 -0.03938
C  1.763127 3.355969 -0.032737
C  2.252091 -1.293512 0.012532
C  2.973799 -1.35552 -1.208903
C  2.974682 -1.336001 1.234289
C  4.384102 -1.447755 -1.217044
C  4.384991 -1.42797 1.242877
C  5.068436 -1.48055 0.013012
H  -2.12153 -2.197481 0.023879
H  -3.689831 2.609812 -0.019566
H  0.241974 -2.199237 0.022713
H  -1.58766 4.185991 -0.037423
H  2.589583 1.341049 -0.014007
H  -5.346067 0.694049 0.000176
H  0.687874 5.250735 -0.050056
H  2.747606 3.836099 -0.038395
H  2.432721 -1.326593 -2.1606
H  2.4343 -1.291807 2.185794
H  4.93534 -1.49232 -2.160663
H  4.936947 -1.457256 2.186678
