program: Gaussian 09
title: 000229449
version: EM64L-G09RevD.01
frameworkgroup: C1[X(C11H19N5O3)]
method: RPBEPBE
basis: SDD
operation: Freq
keyword: #p
keyword: freq=noraman
keyword: PBEPBE/SDD
title: #p freq=noraman PBEPBE/SDD
converged: YES YES NO NO
title: Mulliken charges:
elementType: O O O N N N N N C C C C C C C C C C C H H H H H H H H H H H H H H H H H H H
charge: -0.218250 -0.221892 -0.245115 -0.427987 -0.405168 0.081774 -0.407119 -0.644121 0.251810 -0.441905 -0.355642 -0.381114 0.117853 -0.356375 -0.332290 0.155544 -0.357275 -0.695489 0.309131 0.225729 0.231704 0.218182 0.210110 0.193760 0.193551 0.356001 0.191556 0.192974 0.247452 0.349975 0.195395 0.195665 0.215901 0.210439 0.211435 0.278273 0.349577 0.305952
chargesum: 0.00000
title: Mulliken charges with hydrogens summed into heavy atoms:
elementType: O O O N N N N N C C C C C C C C C C C
charge: -0.218250 -0.221892 -0.245115 -0.071986 -0.055193 0.081774 -0.128846 0.011408 0.251810 0.015528 0.072649 0.006196 0.117853 0.028155 -0.084838 0.155544 0.033785 -0.057714 0.309131
polarizability: 2.09925267e+02 2.44179211e+01 1.49465543e+02 5.99075001e+00 -5.84040394e+00 1.56742218e+02
1716.lowfreq: -7.9355 -1.2378 -0.0005 0.0002 0.0007 3.9171 19.8067 32.4883 35.6197
frequency: 19.5507 32.4720 35.6097 45.7002 50.0397 61.1292 85.3256 103.0465 115.9278 124.9183 136.0375 152.9080 169.0148 172.6949 198.1603 230.5580 238.1302 245.6029 286.2238 317.5112 357.9180 371.5246 386.2999 427.3891 441.0410 474.1952 508.4178 545.4175 558.3865 574.0156 597.3918 606.7196 633.1313 662.9784 671.8869 710.0175 714.8353 725.2426 737.7639 746.4478 776.9700 803.9386 876.1118 886.3475 894.7695 930.1348 958.4334 971.0177 1000.7641 1013.7026 1026.2911 1045.0819 1064.2960 1073.6554 1082.1773 1102.9853 1119.6300 1144.8471 1180.9301 1194.7849 1224.4184 1235.4004 1258.6891 1279.1672 1283.6412 1287.4144 1292.1910 1302.8262 1305.8730 1313.2146 1323.6493 1331.2757 1351.6690 1355.9341 1378.3060 1390.5193 1451.4803 1464.5291 1466.2809 1474.3073 1477.3971 1482.7828 1489.3409 1501.7372 1605.7181 1613.7858 1679.4255 1688.2673 1725.6823 2953.6538 2958.2842 2968.5126 2972.5179 2975.2509 2986.4057 2990.7092 3006.1495 3010.9230 3026.2851 3037.9154 3058.5309 3069.1718 3071.7505 3391.8320 3537.6345 3567.2050 3585.0152 3692.3918
redmass: 5.7890 4.6490 4.7597 6.5770 1.5591 5.0400 4.0941 3.9747 1.6531 5.8253 3.2847 3.2780 6.8781 2.0377 5.0840 1.2391 2.6799 3.0559 4.5350 2.9568 1.9935 5.8843 4.6868 3.3222 3.5019 3.1103 1.1391 1.6749 2.1463 1.3507 4.7466 7.6763 2.5333 1.7057 5.0714 8.2827 5.8828 1.0713 1.6022 2.4593 1.8755 1.9081 1.3220 1.7709 1.6628 2.9130 2.8947 1.5260 3.1495 3.8849 2.3118 2.4395 3.1389 2.7563 2.2605 2.1734 2.8049 3.9728 2.6190 1.9691 2.2525 1.3260 1.4354 1.4117 1.4057 1.1353 1.1686 1.3880 2.2489 3.0978 1.4624 1.6447 1.5178 1.6559 1.6270 1.2157 1.0923 1.0652 1.0764 1.0716 1.0434 1.0794 1.0902 1.7728 1.4032 4.3667 8.6491 5.5872 9.6108 1.0586 1.0588 1.0591 1.0367 1.0595 1.0592 1.0967 1.1004 1.0891 1.1021 1.1037 1.1045 1.1007 1.0993 1.0756 1.0460 1.0792 1.0804 1.1037
irintensity: 1.0280 1.4589 18.0372 0.5596 0.1833 6.0592 0.1625 2.0220 0.0047 1.2384 0.5694 0.7254 3.8846 8.6407 1.7071 0.1559 0.7875 0.8467 5.1729 13.4818 39.6038 2.1120 36.1476 0.8705 4.6107 15.7777 213.5283 96.7998 30.8239 147.4648 12.6043 19.1589 33.2875 86.6009 22.0687 31.4728 61.0911 14.4563 3.9381 26.9240 10.6146 7.7510 2.6726 30.2048 11.1481 6.0945 27.0364 0.7873 0.6582 5.3445 3.2301 19.6074 6.0361 2.3177 2.0960 12.1292 59.3469 139.7741 6.5771 13.7351 34.7549 12.6110 12.4036 222.9904 95.5599 58.4288 24.5203 116.3114 63.2463 46.0681 37.9267 76.4608 0.8953 2.0119 8.2018 10.8336 5.3804 0.3300 0.4534 1.6589 12.4484 2.5076 21.9738 326.8337 132.1561 1.0317 498.2914 252.7138 435.2938 1.2493 7.4343 63.7626 34.3965 36.0849 42.8063 1.9966 0.7490 30.9939 10.0752 33.4675 47.9470 94.8266 55.3189 7.4680 61.4206 73.9147 65.4076 46.0585
temp: 298.150 k
press: 1.00000 atm
elementType: 8 8 8 7 7 7 7 7 6 6 6 6 6 6 6 6 6 6 6 1 1 1 1 1 1 1 1 1 1 1 1 1 1 1 1 1 1 1
symmnumber: 1
zpe: 809354.5 jmol-1
zpe.correction: 0.308267 hartree
zpe.thermalcorrener: 0.329375 hartree
zpe.thermalcorrenthalpy: 0.330319 hartree
zpe.thermalcorrgfe: 0.255479 hartree
zpe.sumelectzpe: -928.553348 hartree
zpe.sumelectthermal: -928.532240 hartree
zpe.sumelectthermalent: -928.531296 hartree
zpe.sumelectthermalfe: -928.606135 hartree
dipole: -2.3418 -3.3415 5.1965
dipole: 6.6071
quadrupole: -83.8124 -116.9146 -128.7689
quadrupole: 9.5112 -23.3142 -1.2527
quadrupole: 26.0195 -7.0826 -18.9369 9.5112 -23.3142 -1.2527
hfenergy: -928.8616144 hartree
pointgroup: C01 [X(C11H19N5O3)]
dipole: -1.0388386 2.3527275 -0.3775376 debye
polarizability: 204.4312181|-11.9304624|158.3313676|-28.5163569|-2.7095346|153.3704424 unknown
InChI: InChI=1S/C11H19N5O3/c1-2-3-4-5-6-11(7-13-16-9(12)18)8(17)14-10(19)15-11/h7,14-16H,2-6,12H2,1H3
charge 0 multiplicity 1
38 atoms
O  -0.071578 0.408648 -2.978725
O  -0.276621 -3.644362 -0.572859
O  -4.038136 -0.13296 2.892917
N  -0.367851 -1.361143 0.120932
N  -0.04745 -1.787735 -2.064713
N  -2.422376 0.373821 0.666343
N  -3.595094 1.053227 0.892968
N  -5.594509 1.396586 2.061652
C  -0.344909 -0.036764 -0.520735
C  0.840585 0.864537 -0.034517
C  2.237304 0.235304 -0.217806
C  3.356922 1.129661 0.361407
C  -0.144349 -0.401506 -2.023557
C  4.764214 0.513205 0.194934
C  -1.657171 0.715073 -0.334509
C  -0.238928 -2.410727 -0.778016
C  5.891619 1.402096 0.767683
C  7.29273 0.774125 0.604218
C  -4.388167 0.699628 2.022274
H  0.782675 1.82027 -0.591498
H  0.662661 1.092523 1.034779
H  2.261742 -0.755009 0.277423
H  2.434014 0.064877 -1.295536
H  3.16298 1.311954 1.439284
H  3.3309 2.12278 -0.133801
H  -0.800196 -1.495072 1.036893
H  4.95864 0.325888 -0.881861
H  4.791341 -0.47839 0.692912
H  -1.851948 1.541631 -1.04412
H  0.096153 -2.339085 -2.911389
H  5.867182 2.390854 0.265423
H  5.694239 1.593923 1.842312
H  8.081411 1.428269 1.019459
H  7.526101 0.598546 -0.463064
H  7.352845 -0.200406 1.124592
H  -3.882018 1.828359 0.277944
H  -6.19876 1.212341 2.858807
H  -5.9427 1.985732 1.30785
