program: Gaussian 09
title: 000229444
version: EM64L-G09RevD.01
frameworkgroup: C1[X(C10H16N2O3)]
method: RPBEPBE
basis: SDD
operation: Freq
keyword: #p
keyword: freq=noraman
keyword: PBEPBE/SDD
title: #p freq=noraman PBEPBE/SDD
converged: YES YES NO NO
title: Mulliken charges:
elementType: O O O N N C C C C C C C C C C H H H H H H H H H H H H H H H H
charge: -0.181944 -0.140721 -0.219689 -0.444664 -0.397873 0.190228 -0.416307 -0.387548 -0.378372 -0.355784 0.141026 -0.108824 -0.357795 0.173179 -0.695067 0.253670 0.217663 0.228253 0.176323 0.204791 0.194865 0.187431 0.194213 0.336734 0.193285 0.196147 0.199007 0.358810 0.218075 0.209551 0.211338
chargesum: 0.00000
title: Mulliken charges with hydrogens summed into heavy atoms:
elementType: O O O N N C C C C C C C C C C
charge: -0.181944 -0.140721 -0.219689 -0.107930 -0.039062 0.190228 0.055027 0.017028 0.021284 0.025859 0.141026 0.084461 0.037358 0.173179 -0.056103
polarizability: 1.53882355e+02 1.49441656e+01 1.28722509e+02 -6.94563912e+00 5.68618901e+00 1.05411668e+02
1716.lowfreq: -14.2430 -5.3390 -1.2161 0.0003 0.0006 0.0007 24.6948 28.6072 53.9636
frequency: 23.5008 28.3037 53.9527 68.1094 80.2237 93.5390 106.6470 134.9446 141.9689 157.1554 187.8183 234.1744 237.1159 250.2826 278.7943 359.1542 404.6443 417.0769 433.9694 474.4064 492.6112 596.2588 605.8520 641.8759 681.5485 688.4422 721.6728 727.7462 736.4121 774.1404 788.4588 869.0633 888.2297 899.2653 950.5439 974.9489 997.5921 1011.3372 1023.1674 1064.2801 1064.9264 1079.9166 1119.0364 1143.4046 1160.5445 1179.2833 1204.7616 1232.9616 1256.8255 1283.3565 1285.2187 1292.8476 1301.5885 1303.8000 1315.4085 1330.6524 1349.4367 1352.3545 1355.9792 1372.0922 1388.8611 1448.5389 1461.5134 1463.5621 1471.5801 1477.8050 1480.4299 1487.6470 1637.2298 1691.5142 1727.8399 2888.7649 2952.6317 2954.7315 2961.4392 2969.4170 2972.4533 2991.5225 2998.9433 3008.7212 3025.6850 3041.5882 3068.8383 3070.2172 3072.4642 3585.6480 3606.7572
redmass: 1.8048 3.7441 4.7056 5.4850 5.2960 3.6707 1.7558 3.7395 2.4772 7.7774 4.2988 1.3116 2.3026 2.9375 3.2936 7.6303 4.7856 3.1448 5.6996 3.4191 1.2183 4.1335 9.1819 1.2669 4.0720 4.2334 1.0749 6.2539 1.1945 2.2837 1.6978 1.5137 1.9368 2.2223 2.2166 1.8853 2.2313 3.4776 2.2586 3.0279 2.4788 2.2159 2.7572 3.7119 2.8799 3.2808 1.6181 1.3200 1.3059 1.3761 1.0838 1.1740 3.5873 1.1150 1.7088 1.4711 1.4947 1.5679 1.5011 1.3854 1.2161 1.0805 1.0692 1.0747 1.0771 1.0447 1.0771 1.0862 9.4953 8.6413 9.8014 1.0872 1.0593 1.0611 1.0611 1.0597 1.0363 1.0966 1.0637 1.0970 1.1001 1.1026 1.1012 1.1022 1.0993 1.0803 1.0800
irintensity: 0.0011 0.1554 0.2106 0.9636 5.7650 1.3687 0.0639 1.0961 0.1522 3.3184 0.3459 1.0414 3.1427 4.3752 7.6367 9.5540 3.3726 0.2828 6.0977 27.7823 73.6549 12.3043 4.3891 163.2025 15.1387 9.1236 17.7828 56.7322 7.8648 9.6841 17.3394 17.7473 5.0821 18.3686 24.2724 11.6549 5.3584 2.9124 12.2670 2.3684 6.4789 0.6283 18.1047 30.2486 5.4056 64.7220 13.0116 4.9384 2.9069 20.1533 6.0905 5.3173 219.8338 7.6805 8.6163 7.5873 5.5605 3.0166 0.4713 13.0102 10.9716 5.0662 0.1358 0.8430 1.6359 11.9267 5.2107 20.9647 113.8452 639.6546 355.4462 85.1696 1.0688 9.0798 15.8420 109.0214 36.2897 1.6024 13.1630 3.3136 7.4287 63.2918 35.2844 79.7863 52.2876 85.9587 44.3892
temp: 298.150 k
press: 1.00000 atm
elementType: 8 8 8 7 7 6 6 6 6 6 6 6 6 6 6 1 1 1 1 1 1 1 1 1 1 1 1 1 1 1 1
symmnumber: 1
zpe: 665063.7 jmol-1
zpe.correction: 0.253309 hartree
zpe.thermalcorrener: 0.269875 hartree
zpe.thermalcorrenthalpy: 0.270820 hartree
zpe.thermalcorrgfe: 0.206805 hartree
zpe.sumelectzpe: -724.697359 hartree
zpe.sumelectthermal: -724.680793 hartree
zpe.sumelectthermalent: -724.679849 hartree
zpe.sumelectthermalfe: -724.743863 hartree
dipole: -1.7595 1.6005 0.3316
dipole: 2.4016
quadrupole: -90.6259 -109.8730 -90.4613
quadrupole: -4.3516 0.5037 -2.1701
quadrupole: 6.3608 -12.8863 6.5254 -4.3516 0.5037 -2.1701
hfenergy: -724.9506687 hartree
pointgroup: C01 [X(C10H16N2O3)]
dipole: -0.6981483 -0.6132378 -0.171063 debye
polarizability: 153.6918834|-15.5698807|128.0534649|5.6797545|7.3101895|106.2711832 unknown
InChI: InChI=1S/C10H16N2O3/c1-2-3-4-5-6-10(7-13)8(14)11-9(15)12-10/h7,11-12H,2-6H2,1H3
charge 0 multiplicity 1
31 atoms
O  2.619928 1.497539 1.589161
O  0.601524 2.418128 -1.302154
O  3.333763 -2.613594 -0.613489
N  1.591205 -0.991808 -0.758733
N  3.304288 -0.560702 0.619237
C  1.246808 0.31124 -0.164922
C  -0.08912 0.354043 0.618261
C  -1.328453 -0.022963 -0.223822
C  -2.631623 0.064699 0.603273
C  -3.89134 -0.300219 -0.213474
C  2.461575 0.5367 0.806966
C  1.330305 1.408387 -1.262796
C  -5.197706 -0.201544 0.607042
C  2.7929 -1.528889 -0.306603
C  -6.452712 -0.562527 -0.216578
H  -0.197408 1.383591 1.006322
H  -0.008769 -0.3222 1.490994
H  -1.40904 0.653476 -1.096407
H  -1.226038 -1.057516 -0.615103
H  -2.738284 1.0945 1.001605
H  -2.556827 -0.606111 1.484421
H  -3.788248 -1.331359 -0.61232
H  -3.963448 0.369637 -1.095551
H  0.98409 -1.510029 -1.390943
H  2.118991 1.203604 -2.030819
H  -5.126654 -0.870884 1.488646
H  -5.299411 0.828261 1.005883
H  4.176021 -0.71034 1.12845
H  -7.372806 -0.48031 0.390568
H  -6.392083 -1.598895 -0.599472
H  -6.561529 0.110784 -1.087741
