program: Gaussian 09
title: 000229438
version: EM64L-G09RevD.01
frameworkgroup: C1[X(C8H13N5O3)]
method: RPBEPBE
basis: SDD
operation: Freq
keyword: #p
keyword: freq=noraman
keyword: PBEPBE/SDD
title: #p freq=noraman PBEPBE/SDD
converged: YES YES NO NO
title: Mulliken charges:
elementType: O O O N N N N N C C C C C C C C H H H H H H H H H H H H H
charge: -0.218081 -0.222278 -0.244933 -0.427121 -0.405896 0.081097 -0.406007 -0.644300 0.242890 -0.394185 0.121164 -0.346007 -0.324120 0.158352 -0.700077 0.309274 0.224472 0.219360 0.356041 0.216794 0.222659 0.247649 0.350431 0.212765 0.212911 0.223407 0.278072 0.305949 0.349717
chargesum: 0.00000
title: Mulliken charges with hydrogens summed into heavy atoms:
elementType: O O O N N N N N C C C C C C C C
charge: -0.218081 -0.222278 -0.244933 -0.071080 -0.055465 0.081097 -0.127935 0.011366 0.242890 0.049647 0.121164 0.093446 -0.076471 0.158352 -0.050993 0.309274
polarizability: 1.75481160e+02 5.58494936e+00 1.16045459e+02 5.23722387e+00 -1.47347945e+01 1.22300254e+02
1716.lowfreq: -7.7908 -1.8081 0.0007 0.0007 0.0011 6.4485 28.4435 38.0451 52.0558
frequency: 28.3985 38.0189 52.0460 65.2172 78.6321 96.8538 121.7894 144.9324 167.5245 172.0467 232.1206 239.6602 243.9368 259.5340 317.5986 332.2965 359.8097 384.8345 407.1300 468.0854 507.3180 543.9717 556.9909 573.2300 597.2577 606.4836 631.7318 663.7196 671.7478 709.9063 715.2692 738.2522 750.1013 789.1573 867.7863 884.4183 912.0026 931.9499 959.9403 1004.9485 1038.3146 1053.2707 1056.5054 1097.8021 1115.9190 1145.4746 1185.2149 1211.8137 1258.3504 1277.2682 1285.1879 1302.1498 1305.5420 1313.4426 1330.0908 1345.8382 1376.7320 1394.8552 1451.8397 1474.2897 1480.2927 1485.5863 1501.2242 1605.8434 1613.9940 1679.3570 1688.4125 1725.7205 2975.7150 2981.5637 2989.4606 3010.1487 3030.1596 3053.4093 3075.5851 3077.7380 3391.0818 3537.5232 3567.3149 3585.0814 3692.3485
redmass: 6.2662 4.0871 6.6402 3.6100 2.0583 3.5808 5.7969 6.0706 7.1432 1.9957 1.9921 3.5990 1.5197 3.8799 3.4223 2.8925 2.1595 5.8487 5.3220 3.0740 1.1375 1.7063 2.1616 1.3296 4.9263 7.4210 2.7158 1.6600 4.6097 8.3674 5.6701 1.9458 2.2007 3.3009 1.3895 1.6643 1.7834 2.7565 3.1248 2.8322 2.6724 3.0129 2.5103 2.4847 2.7274 4.0679 2.8943 2.5590 1.5381 1.3698 1.6380 1.3924 2.1972 3.2489 1.7214 1.5059 1.6181 1.2127 1.0918 1.0570 1.0423 1.0754 1.7742 1.3862 4.5390 8.6594 5.5852 9.6095 1.0358 1.0597 1.0592 1.0890 1.0996 1.1031 1.1020 1.0992 1.0756 1.0460 1.0792 1.0804 1.1037
irintensity: 9.1216 10.5236 4.5780 0.5779 1.2203 2.8336 0.4322 2.2268 3.8328 8.9151 0.6291 1.5107 0.9482 3.3197 1.2313 22.5624 37.6032 15.8205 24.1978 9.9751 217.8735 91.9065 32.9533 145.2314 10.5505 20.2180 27.1348 82.0939 29.1031 29.6018 62.9301 11.7737 32.1359 8.5819 3.5266 23.4955 24.6849 1.9752 25.9539 2.6239 16.7356 8.7241 5.2742 6.8165 79.1810 121.7657 5.1944 47.7944 16.9028 149.3348 253.8538 126.0532 58.5030 46.0751 105.6993 1.6159 6.6719 10.3958 5.9316 3.3587 13.4559 11.4515 318.8857 130.5878 0.8504 505.5880 255.2232 440.9720 36.0767 0.4888 41.0103 30.4244 0.1765 3.2565 65.9232 41.5519 7.3326 60.0129 73.4086 66.3474 46.0766
temp: 298.150 k
press: 1.00000 atm
elementType: 8 8 8 7 7 7 7 7 6 6 6 6 6 6 6 6 1 1 1 1 1 1 1 1 1 1 1 1 1
symmnumber: 1
zpe: 589723.7 jmol-1
zpe.correction: 0.224614 hartree
zpe.thermalcorrener: 0.241503 hartree
zpe.thermalcorrenthalpy: 0.242448 hartree
zpe.thermalcorrgfe: 0.178565 hartree
zpe.sumelectzpe: -810.884048 hartree
zpe.sumelectthermal: -810.867159 hartree
zpe.sumelectthermalent: -810.866215 hartree
zpe.sumelectthermalfe: -810.930098 hartree
dipole: -3.1497 -3.7965 4.4436
dipole: 6.6392
quadrupole: -71.7636 -100.5533 -103.6597
quadrupole: 2.9338 -19.7681 6.8629
quadrupole: 20.2286 -8.5611 -11.6675 2.9338 -19.7681 6.8629
hfenergy: -811.1086624 hartree
pointgroup: C01 [X(C8H13N5O3)]
dipole: 1.555546 -2.0181819 -0.5746117 debye
polarizability: 165.6694839|-5.3710171|127.4714054|24.3074248|11.6009845|120.6859833 unknown
InChI: InChI=1S/C8H13N5O3/c1-2-3-8(4-10-13-6(9)15)5(14)11-7(16)12-8/h4,11-13H,2-3,9H2,1H3
charge 0 multiplicity 1
29 atoms
O  -1.275981 -0.865602 -2.720597
O  -1.747662 3.150014 -0.289326
O  3.182503 0.690092 2.592279
N  -1.016385 0.967116 0.345311
N  -1.711496 1.272418 -1.77237
N  1.452282 -0.217522 0.589196
N  2.773035 -0.592678 0.645388
N  4.932158 -0.440648 1.537232
C  -0.80017 -0.332187 -0.311479
C  -1.654875 -1.48754 0.312263
C  -1.278066 -0.04856 -1.768446
C  -3.176697 -1.228447 0.315859
C  0.668172 -0.740352 -0.313848
C  -1.511154 1.941498 -0.510474
C  -3.942889 -2.354037 1.043249
C  3.601257 -0.048066 1.668458
H  -1.292575 -1.640483 1.347882
H  -1.43335 -2.412339 -0.25594
H  -0.517074 1.21518 1.201456
H  -3.544128 -1.148983 -0.726043
H  -3.381176 -0.258232 0.807183
H  0.962971 -1.499285 -1.063512
H  -2.09281 1.760282 -2.583564
H  -3.767735 -3.334059 0.560891
H  -3.623926 -2.435485 2.099385
H  -5.031291 -2.163609 1.034011
H  3.153277 -1.281233 -0.020002
H  5.306192 -0.946486 0.736743
H  5.575592 -0.108366 2.251414
