program: Gaussian 09
title: 000229425
version: EM64L-G09RevD.01
frameworkgroup: C1[X(C18H12O2)]
method: RPBEPBE
basis: SDD
operation: Freq
keyword: #pfreq=noraman
keyword: PBEPBE/SDD
title: #p freq=noraman PBEPBE/SDD
converged: YES YES NO NO
title: Mulliken charges:
elementType: O O C C C C C C C C C C C C C C C C C C H H H H H H H H H H H H
charge: -0.258138 -0.202632 0.105417 0.362570 0.288978 0.254646 0.236923 0.242590 -0.432934 -0.424543 0.167328 -0.454451 -0.414133 -0.364571 -0.392467 -0.248158 -0.413624 -0.250690 -0.244959 -0.531056 0.230317 0.291866 0.275898 0.224129 0.249382 0.231665 0.295897 0.229603 0.236780 0.229697 0.229633 0.249036
chargesum: 0.00000
title: Mulliken charges with hydrogens summed into heavy atoms:
elementType: O O C C C C C C C C C C C C C C C C C C
charge: -0.258138 -0.202632 0.105417 0.362570 0.288978 0.254646 0.236923 0.242590 -0.432934 -0.194225 0.167328 -0.162586 -0.138235 -0.140442 -0.143085 -0.016493 -0.117727 -0.021087 -0.008179 0.177310
polarizability: 3.47787884e+02 -6.68922155e+00 2.37163303e+02 1.94895173e-02 6.69745506e-03 7.94730381e+01
1716.lowfreq: -12.3651 -2.2816 -0.0009 -0.0004 0.0004 8.9073 43.6485 79.4504 101.3361
frequency: 43.6464 79.4495 101.3351 128.8121 157.4136 167.5743 190.9311 233.6802 252.0079 273.8183 296.3626 324.1897 339.3992 372.7714 393.1989 427.5028 450.6224 466.8867 473.2238 501.2701 561.4985 562.8303 597.9980 609.5554 626.4197 647.5705 686.3158 703.1127 708.3732 774.2720 781.3465 783.2705 814.8170 815.8852 847.7960 876.0922 882.6359 930.0197 953.2704 957.0559 978.6866 993.3505 996.8679 1011.8314 1026.5498 1033.8691 1060.5608 1089.9607 1099.9941 1114.1913 1146.6566 1158.4955 1175.7402 1183.9077 1198.5292 1217.6894 1245.0093 1264.8015 1297.8034 1315.0545 1366.8416 1378.7453 1390.3943 1415.0298 1422.8191 1439.2963 1446.4725 1460.8873 1469.3131 1473.5510 1482.9463 1524.1043 1529.2298 1575.1733 1577.2260 1592.8036 1615.8601 1623.5206 2972.8096 3066.2917 3129.5877 3134.5520 3138.6139 3146.0127 3148.9635 3155.7203 3162.6889 3169.0763 3172.7142 3180.7486
redmass: 5.1194 4.2473 3.9495 4.3572 4.7976 4.0153 4.1072 1.1644 4.4770 4.2413 6.2849 4.7927 7.7895 4.9636 7.5593 3.2646 4.1478 7.9314 3.5295 6.7227 3.8488 6.6243 3.6251 5.8112 6.1786 6.2058 3.7465 2.4741 6.6612 2.5301 5.6441 1.3865 1.6881 6.1158 1.8982 1.5582 6.4261 1.5357 2.4075 7.6981 1.3783 1.3637 1.5607 1.5255 4.2846 3.5771 2.6991 2.0530 2.2115 1.2584 1.4130 1.6333 1.0781 1.7371 1.4878 1.5940 2.8072 1.6435 3.1835 2.1947 3.1758 5.3181 5.4819 4.6247 3.0548 1.4197 2.8133 2.2006 1.0491 1.1166 2.8128 5.1071 8.2739 6.8045 5.6974 6.4466 6.8278 7.6550 1.0322 1.1044 1.0855 1.1006 1.0871 1.0893 1.0891 1.0945 1.0927 1.0989 1.0941 1.0969
irintensity: 3.4597 0.0492 0.3419 10.5334 1.7044 4.3181 0.0465 0.4345 3.1165 1.2310 1.0078 0.2980 4.8211 6.6891 2.1260 0.6017 0.0561 11.0196 0.6129 2.2262 0.8388 1.1782 7.5297 12.3528 1.2371 13.4369 0.0219 14.7425 8.0022 9.0346 2.8772 115.9017 46.1193 1.7523 12.9135 5.6406 19.2708 0.9501 0.7770 7.1182 1.1153 0.1730 4.3465 4.0446 59.1605 23.2419 20.6187 53.1411 19.5503 0.0949 7.0286 8.0959 1.2224 13.7848 1.1964 3.3804 248.2772 6.3346 85.4162 139.9942 100.9430 5.3168 0.4150 2.6530 112.4619 15.3385 1.3351 14.6351 14.9819 46.0249 8.2848 64.0328 160.0513 15.4076 144.7131 91.8611 9.8832 22.6363 78.2905 37.5517 3.5705 18.8125 17.5223 5.3709 0.2227 0.6176 17.3005 46.9644 12.5870 11.8060
temp: 298.150 k
press: 1.00000 atm
elementType: 8 8 6 6 6 6 6 6 6 6 6 6 6 6 6 6 6 6 6 6 1 1 1 1 1 1 1 1 1 1 1 1
symmnumber: 1
zpe: 644582.5 jmol-1
zpe.correction: 0.245508 hartree
zpe.thermalcorrener: 0.260345 hartree
zpe.thermalcorrenthalpy: 0.261289 hartree
zpe.thermalcorrgfe: 0.203961 hartree
zpe.sumelectzpe: -842.246260 hartree
zpe.sumelectthermal: -842.231423 hartree
zpe.sumelectthermalent: -842.230479 hartree
zpe.sumelectthermalfe: -842.287808 hartree
dipole: -3.4173 2.8365 0.0006
dipole: 4.4411
quadrupole: -80.1947 -113.2806 -120.6228
quadrupole: 14.0458 -0.0027 0.0003
quadrupole: 24.5047 -8.5813 -15.9234 14.0458 -0.0027 0.0003
hfenergy: -842.4917685 hartree
pointgroup: C01 [X(C18H12O2)]
dipole: -1.3556235 1.1023329 -0.0078734 debye
polarizability: 347.2162803|-6.3491186|236.273767|-13.4025851|-10.808334|80.9341783 unknown
InChI: InChI=1S/C18H12O2/c1-20-16-10-9-15-17-12(7-4-8-14(16)17)11-5-2-3-6-13(11)18(15)19/h2-10H,1H3
charge 0 multiplicity 1
32 atoms
O  -4.228657 0.365379 0.311798
O  1.349894 -2.925658 0.255177
C  -0.512363 0.287531 0.122908
C  0.573324 1.2306 -0.000164
C  -0.264485 -1.12798 0.210525
C  1.9665 0.726719 -0.036185
C  -1.873805 0.769317 0.159306
C  2.224662 -0.67928 0.050653
C  1.116087 -1.669977 0.178635
C  0.264632 2.603957 -0.082078
C  -2.949281 -0.187698 0.283087
C  -1.345459 -2.019215 0.328759
C  -2.139064 2.170197 0.073358
C  3.086734 1.598795 -0.155958
C  -2.684922 -1.566589 0.365938
C  -1.076383 3.071162 -0.046056
C  3.555325 -1.172088 0.017126
C  4.401984 1.101418 -0.188465
C  4.644195 -0.29387 -0.101689
C  -5.373403 -0.545387 0.436801
H  1.065043 3.343488 -0.176245
H  -1.115104 -3.087923 0.392215
H  -3.175546 2.515452 0.102742
H  2.937716 2.680311 -0.224871
H  -3.496436 -2.293106 0.458398
H  -1.273275 4.146166 -0.112699
H  3.692508 -2.255805 0.087354
H  5.242357 1.798434 -0.281437
H  5.669068 -0.678702 -0.12742
H  -5.324914 -1.116005 1.383311
H  -5.420704 -1.242658 -0.420725
H  -6.257628 0.107716 0.438002
