program: Gaussian 09
title: 000229419
version: EM64L-G09RevD.01
frameworkgroup: C1[X(C12H13NOS)]
method: RPBEPBE
basis: SDD
operation: Freq
keyword: #p
keyword: freq=noraman
keyword: PBEPBE/SDD
title: #p freq=noraman PBEPBE/SDD
converged: YES YES NO NO
title: Mulliken charges:
elementType: S O N C C C C C C C C C C C C H H H H H H H H H H H H H
charge: 0.274958 -0.253476 0.028641 -0.565626 -0.003132 -0.380488 -0.426497 -0.433755 -0.216972 0.192079 -0.378096 -0.317256 -0.205263 -0.219186 -0.250544 0.297745 0.258476 0.250058 0.219355 0.204072 0.251828 0.233754 0.234397 0.256170 0.276780 0.225869 0.220776 0.225334
chargesum: 0.00000
title: Mulliken charges with hydrogens summed into heavy atoms:
elementType: S O N C C C C C C C C C C C C
charge: 0.274958 -0.253476 0.028641 -0.267881 0.255343 0.088925 0.029403 0.034396 -0.216972 0.192079 -0.121926 -0.040477 0.020605 0.001590 -0.025210
polarizability: 2.51680249e+02 5.61167297e+00 1.48921406e+02 1.00123923e+01 -8.77534267e+00 8.70185718e+01
1716.lowfreq: -0.0023 -0.0006 0.0015 5.6962 8.0288 17.0410 28.5773 40.9240 67.8984
frequency: 28.5117 40.0322 67.8566 89.0722 102.3669 207.9788 242.6151 268.5443 274.9122 329.5749 382.6969 412.5663 442.9952 500.3321 526.4281 564.9115 576.6432 591.5030 611.4538 652.4595 675.0111 696.4932 768.1970 776.6352 800.7771 840.6499 847.6977 850.5837 878.3292 905.6448 923.2647 926.9314 940.1645 963.1580 979.1002 987.0106 992.7757 1021.1248 1023.4043 1061.9976 1078.0296 1084.3011 1128.0543 1161.6832 1167.3509 1177.5247 1190.4270 1211.3293 1226.8611 1243.0531 1278.3315 1296.6540 1303.1821 1311.1732 1313.8700 1322.1807 1372.3383 1439.1139 1448.2080 1462.5195 1475.5199 1479.6163 1576.0502 1604.4701 1688.1037 2998.6809 3000.3938 3017.7980 3048.3239 3073.9125 3077.9886 3084.5561 3093.9569 3123.0977 3134.6499 3153.3641 3168.3289 3182.1560
redmass: 3.8676 3.3976 4.2317 5.8733 5.5735 2.8759 6.1684 4.7932 4.4502 3.5335 2.5098 2.9096 7.5236 3.6226 9.2818 7.6703 2.1638 6.8323 6.2674 3.4430 6.2608 1.8587 5.4688 1.7959 5.0414 2.4112 1.2463 2.4062 2.2256 2.5324 2.4252 1.4712 4.1129 4.0665 1.3691 6.2272 1.3090 1.5651 2.1189 1.8039 1.5541 1.7363 1.3923 1.5860 1.0740 1.2092 1.4841 3.0333 1.2552 1.3821 1.3173 1.2720 1.3302 1.3783 1.4021 1.4270 6.1919 2.4073 1.0880 1.0804 2.2529 1.0937 6.0776 6.1951 12.2467 1.0657 1.0653 1.0620 1.0879 1.0893 1.0988 1.0981 1.1035 1.0850 1.0897 1.0950 1.0979 1.0954
irintensity: 0.3527 0.5947 0.7382 1.5001 0.6977 2.1116 2.7593 0.7512 1.7834 0.9725 4.2413 0.1170 2.0730 10.6673 48.8140 3.9700 2.1676 0.9946 0.5150 7.0165 2.8229 46.5537 4.4299 64.2344 0.2361 44.3560 0.0624 6.7236 0.2971 4.5987 54.8415 9.9793 71.9638 170.4261 0.1462 0.8103 0.8911 7.9473 7.0570 0.4282 8.7165 3.9992 6.9999 1.6045 0.3509 3.3746 6.1644 3.1212 20.1680 3.8194 1.9584 9.5791 1.8733 0.9672 3.4469 5.9215 5.5317 3.1394 16.5283 15.1364 33.6410 11.9527 15.9753 126.4410 837.9030 31.5460 28.4080 25.2054 27.7827 21.6217 13.5064 12.8134 57.0322 1.6644 18.5693 37.1939 18.5587 4.1217
temp: 298.150 k
press: 1.00000 atm
elementType: 16 8 7 6 6 6 6 6 6 6 6 6 6 6 6 1 1 1 1 1 1 1 1 1 1 1 1 1
symmnumber: 1
zpe: 585988.1 jmol-1
zpe.correction: 0.223191 hartree
zpe.thermalcorrener: 0.236022 hartree
zpe.thermalcorrenthalpy: 0.236966 hartree
zpe.thermalcorrgfe: 0.182052 hartree
zpe.sumelectzpe: -992.010019 hartree
zpe.sumelectthermal: -991.997188 hartree
zpe.sumelectthermalent: -991.996244 hartree
zpe.sumelectthermalfe: -992.051158 hartree
dipole: -3.5970 2.6896 -0.5828
dipole: 4.5290
quadrupole: -76.9980 -94.9549 -97.0545
quadrupole: -2.7078 2.9198 -1.6046
quadrupole: 12.6712 -5.2858 -7.3854 -2.7078 2.9198 -1.6046
hfenergy: -992.2332102 hartree
pointgroup: C01 [X(C12H13N1O1S1)]
dipole: -1.3894353 -0.5093958 0.9924754 debye
polarizability: 250.1817168|-17.2945761|108.1602628|-9.2881548|-29.4712762|129.2782464 unknown
InChI: InChI=1S/C12H13NOS/c1-2-5-9(6-3-1)13-12-14-10-7-4-8-11(10)15-12/h1-3,5-6,10-11H,4,7-8H2
charge 0 multiplicity 1
28 atoms
S  -1.953858 1.452049 -1.390266
O  -0.886044 -0.007412 0.622874
N  0.65886 0.670442 -1.105542
C  -3.160071 0.722134 -0.127867
C  -2.291142 0.222448 1.076092
C  -3.965138 -0.513296 -0.632454
C  -2.888078 -1.143335 1.457291
C  -3.338923 -1.732939 0.097986
C  -0.508746 0.632877 -0.582848
C  1.882076 0.135148 -0.6314
C  3.02411 0.395842 -1.438591
C  2.04015 -0.626567 0.565276
C  4.294623 -0.085795 -1.064694
C  3.316695 -1.10533 0.930251
C  4.448182 -0.839859 0.123321
H  -3.812131 1.553656 0.182012
H  -2.235231 0.952439 1.901662
H  -3.926159 -0.607597 -1.729907
H  -5.027435 -0.401086 -0.342122
H  -3.76084 -0.981608 2.119908
H  -2.156928 -1.765916 1.998823
H  -2.458686 -2.105217 -0.456798
H  -4.048516 -2.570368 0.207393
H  2.880921 0.980512 -2.352598
H  1.169275 -0.833207 1.192273
H  5.16376 0.125332 -1.697801
H  3.429188 -1.689627 1.851126
H  5.435083 -1.215725 0.415402
